(partial) EasyBuild log for failed build of /tmp/easybuild-tmp/eb-6TjmmG/files_pr12753/p/PyTorch/PyTorch-1.7.1-foss-2020b.eb (PR #12753)

Home   »   (partial) EasyBuild log for failed build of /tmp/easybuild-tmp/eb-6TjmmG/files_pr12753/p/PyTorch/PyTorch-1.7.1-foss-2020b.eb (PR #12753)

test_float_domains_asin_cpu_float64 (__main__.TestUnaryUfuncsCPU) ... ok
test_float_domains_atanh_cpu_bfloat16 (__main__.TestUnaryUfuncsCPU) ... skipped 'unsupported dtype'
test_float_domains_atanh_cpu_float16 (__main__.TestUnaryUfuncsCPU) ... skipped 'unsupported dtype'
test_float_domains_atanh_cpu_float32 (__main__.TestUnaryUfuncsCPU) ... ok
test_float_domains_atanh_cpu_float64 (__main__.TestUnaryUfuncsCPU) ... ok
test_float_domains_log10_cpu_bfloat16 (__main__.TestUnaryUfuncsCPU) ... ok
test_float_domains_log10_cpu_float16 (__main__.TestUnaryUfuncsCPU) ... skipped 'unsupported dtype'
test_float_domains_log10_cpu_float32 (__main__.TestUnaryUfuncsCPU) ... ok
test_float_domains_log10_cpu_float64 (__main__.TestUnaryUfuncsCPU) ... ok
test_float_domains_log1p_cpu_bfloat16 (__main__.TestUnaryUfuncsCPU) ... ok
test_float_domains_log1p_cpu_float16 (__main__.TestUnaryUfuncsCPU) ... skipped 'unsupported dtype'
test_float_domains_log1p_cpu_float32 (__main__.TestUnaryUfuncsCPU) ... ok
test_float_domains_log1p_cpu_float64 (__main__.TestUnaryUfuncsCPU) ... ok
test_float_domains_log2_cpu_bfloat16 (__main__.TestUnaryUfuncsCPU) ... ok
test_float_domains_log2_cpu_float16 (__main__.TestUnaryUfuncsCPU) ... skipped 'unsupported dtype'
test_float_domains_log2_cpu_float32 (__main__.TestUnaryUfuncsCPU) ... ok
test_float_domains_log2_cpu_float64 (__main__.TestUnaryUfuncsCPU) ... ok
test_float_domains_log_cpu_bfloat16 (__main__.TestUnaryUfuncsCPU) ... ok
test_float_domains_log_cpu_float16 (__main__.TestUnaryUfuncsCPU) ... skipped 'unsupported dtype'
test_float_domains_log_cpu_float32 (__main__.TestUnaryUfuncsCPU) ... ok
test_float_domains_log_cpu_float64 (__main__.TestUnaryUfuncsCPU) ... ok
test_neg_error_message_cpu (__main__.TestUnaryUfuncsCPU) ... ok
test_non_contig_acos_cpu_bfloat16 (__main__.TestUnaryUfuncsCPU) ... ok
test_non_contig_acos_cpu_complex128 (__main__.TestUnaryUfuncsCPU) ... ok
test_non_contig_acos_cpu_complex64 (__main__.TestUnaryUfuncsCPU) ... ok
test_non_contig_acos_cpu_float32 (__main__.TestUnaryUfuncsCPU) ... ok
test_non_contig_acos_cpu_float64 (__main__.TestUnaryUfuncsCPU) ... ok
test_non_contig_acosh_cpu_float32 (__main__.TestUnaryUfuncsCPU) ... ok
test_non_contig_acosh_cpu_float64 (__main__.TestUnaryUfuncsCPU) ... ok
test_non_contig_asin_cpu_bfloat16 (__main__.TestUnaryUfuncsCPU) ... ok
test_non_contig_asin_cpu_complex128 (__main__.TestUnaryUfuncsCPU) ... ok
test_non_contig_asin_cpu_complex64 (__main__.TestUnaryUfuncsCPU) ... ok
test_non_contig_asin_cpu_float32 (__main__.TestUnaryUfuncsCPU) ... ok
test_non_contig_asin_cpu_float64 (__main__.TestUnaryUfuncsCPU) ... ok
test_non_contig_asinh_cpu_float32 (__main__.TestUnaryUfuncsCPU) ... ok
test_non_contig_asinh_cpu_float64 (__main__.TestUnaryUfuncsCPU) ... ok
test_non_contig_atan_cpu_bfloat16 (__main__.TestUnaryUfuncsCPU) ... ok
test_non_contig_atan_cpu_complex128 (__main__.TestUnaryUfuncsCPU) ... ok
test_non_contig_atan_cpu_complex64 (__main__.TestUnaryUfuncsCPU) ... ok
test_non_contig_atan_cpu_float32 (__main__.TestUnaryUfuncsCPU) ... ok
test_non_contig_atan_cpu_float64 (__main__.TestUnaryUfuncsCPU) ... ok
test_non_contig_atanh_cpu_float32 (__main__.TestUnaryUfuncsCPU) ... ok
test_non_contig_atanh_cpu_float64 (__main__.TestUnaryUfuncsCPU) ... ok
test_non_contig_cos_cpu_bfloat16 (__main__.TestUnaryUfuncsCPU) ... ok
test_non_contig_cos_cpu_complex128 (__main__.TestUnaryUfuncsCPU) ... ok
test_non_contig_cos_cpu_complex64 (__main__.TestUnaryUfuncsCPU) ... ok
test_non_contig_cos_cpu_float32 (__main__.TestUnaryUfuncsCPU) ... ok
test_non_contig_cos_cpu_float64 (__main__.TestUnaryUfuncsCPU) ... ok
test_non_contig_cosh_cpu_complex128 (__main__.TestUnaryUfuncsCPU) ... ok
test_non_contig_cosh_cpu_complex64 (__main__.TestUnaryUfuncsCPU) ... ok
test_non_contig_cosh_cpu_float32 (__main__.TestUnaryUfuncsCPU) ... ok
test_non_contig_cosh_cpu_float64 (__main__.TestUnaryUfuncsCPU) ... ok
test_non_contig_exp2_cpu_float16 (__main__.TestUnaryUfuncsCPU) ... ok
test_non_contig_exp2_cpu_float32 (__main__.TestUnaryUfuncsCPU) ... ok
test_non_contig_exp2_cpu_float64 (__main__.TestUnaryUfuncsCPU) ... ok
test_non_contig_expand_acos_cpu_bfloat16 (__main__.TestUnaryUfuncsCPU) ... ok
test_non_contig_expand_acos_cpu_complex128 (__main__.TestUnaryUfuncsCPU) ... ok
test_non_contig_expand_acos_cpu_complex64 (__main__.TestUnaryUfuncsCPU) ... ok
test_non_contig_expand_acos_cpu_float32 (__main__.TestUnaryUfuncsCPU) ... ok
test_non_contig_expand_acos_cpu_float64 (__main__.TestUnaryUfuncsCPU) ... ok
test_non_contig_expand_acosh_cpu_float32 (__main__.TestUnaryUfuncsCPU) ... ok
test_non_contig_expand_acosh_cpu_float64 (__main__.TestUnaryUfuncsCPU) ... ok
test_non_contig_expand_asin_cpu_bfloat16 (__main__.TestUnaryUfuncsCPU) ... ok
test_non_contig_expand_asin_cpu_complex128 (__main__.TestUnaryUfuncsCPU) ... ok
test_non_contig_expand_asin_cpu_complex64 (__main__.TestUnaryUfuncsCPU) ... ok
test_non_contig_expand_asin_cpu_float32 (__main__.TestUnaryUfuncsCPU) ... ok
test_non_contig_expand_asin_cpu_float64 (__main__.TestUnaryUfuncsCPU) ... ok
test_non_contig_expand_asinh_cpu_float32 (__main__.TestUnaryUfuncsCPU) ... ok
test_non_contig_expand_asinh_cpu_float64 (__main__.TestUnaryUfuncsCPU) ... ok
test_non_contig_expand_atan_cpu_bfloat16 (__main__.TestUnaryUfuncsCPU) ... ok
test_non_contig_expand_atan_cpu_complex128 (__main__.TestUnaryUfuncsCPU) ... ok
test_non_contig_expand_atan_cpu_complex64 (__main__.TestUnaryUfuncsCPU) ... ok
test_non_contig_expand_atan_cpu_float32 (__main__.TestUnaryUfuncsCPU) ... ok
test_non_contig_expand_atan_cpu_float64 (__main__.TestUnaryUfuncsCPU) ... ok
test_non_contig_expand_atanh_cpu_float32 (__main__.TestUnaryUfuncsCPU) ... ok
test_non_contig_expand_atanh_cpu_float64 (__main__.TestUnaryUfuncsCPU) ... ok
test_non_contig_expand_cos_cpu_bfloat16 (__main__.TestUnaryUfuncsCPU) ... ok
test_non_contig_expand_cos_cpu_complex128 (__main__.TestUnaryUfuncsCPU) ... ok
test_non_contig_expand_cos_cpu_complex64 (__main__.TestUnaryUfuncsCPU) ... ok
test_non_contig_expand_cos_cpu_float32 (__main__.TestUnaryUfuncsCPU) ... ok
test_non_contig_expand_cos_cpu_float64 (__main__.TestUnaryUfuncsCPU) ... ok
test_non_contig_expand_cosh_cpu_complex128 (__main__.TestUnaryUfuncsCPU) ... ok
test_non_contig_expand_cosh_cpu_complex64 (__main__.TestUnaryUfuncsCPU) ... ok
test_non_contig_expand_cosh_cpu_float32 (__main__.TestUnaryUfuncsCPU) ... ok
test_non_contig_expand_cosh_cpu_float64 (__main__.TestUnaryUfuncsCPU) ... ok
test_non_contig_expand_exp2_cpu_float16 (__main__.TestUnaryUfuncsCPU) ... ok
test_non_contig_expand_exp2_cpu_float32 (__main__.TestUnaryUfuncsCPU) ... ok
test_non_contig_expand_exp2_cpu_float64 (__main__.TestUnaryUfuncsCPU) ... ok
test_non_contig_expand_log10_cpu_bfloat16 (__main__.TestUnaryUfuncsCPU) ... ok
test_non_contig_expand_log10_cpu_complex128 (__main__.TestUnaryUfuncsCPU) ... ok
test_non_contig_expand_log10_cpu_complex64 (__main__.TestUnaryUfuncsCPU) ... ok
test_non_contig_expand_log10_cpu_float32 (__main__.TestUnaryUfuncsCPU) ... ok
test_non_contig_expand_log10_cpu_float64 (__main__.TestUnaryUfuncsCPU) ... ok
test_non_contig_expand_log1p_cpu_bfloat16 (__main__.TestUnaryUfuncsCPU) ... ok
test_non_contig_expand_log1p_cpu_float32 (__main__.TestUnaryUfuncsCPU) ... ok
test_non_contig_expand_log1p_cpu_float64 (__main__.TestUnaryUfuncsCPU) ... ok
test_non_contig_expand_log2_cpu_bfloat16 (__main__.TestUnaryUfuncsCPU) ... ok
test_non_contig_expand_log2_cpu_complex128 (__main__.TestUnaryUfuncsCPU) ... ok
test_non_contig_expand_log2_cpu_complex64 (__main__.TestUnaryUfuncsCPU) ... ok
test_non_contig_expand_log2_cpu_float32 (__main__.TestUnaryUfuncsCPU) ... ok
test_non_contig_expand_log2_cpu_float64 (__main__.TestUnaryUfuncsCPU) ... ok
test_non_contig_expand_log_cpu_bfloat16 (__main__.TestUnaryUfuncsCPU) ... ok
test_non_contig_expand_log_cpu_complex128 (__main__.TestUnaryUfuncsCPU) ... ok
test_non_contig_expand_log_cpu_complex64 (__main__.TestUnaryUfuncsCPU) ... ok
test_non_contig_expand_log_cpu_float32 (__main__.TestUnaryUfuncsCPU) ... ok
test_non_contig_expand_log_cpu_float64 (__main__.TestUnaryUfuncsCPU) ... ok
test_non_contig_expand_neg_cpu_bfloat16 (__main__.TestUnaryUfuncsCPU) ... ok
test_non_contig_expand_neg_cpu_complex128 (__main__.TestUnaryUfuncsCPU) ... ok
test_non_contig_expand_neg_cpu_complex64 (__main__.TestUnaryUfuncsCPU) ... ok
test_non_contig_expand_neg_cpu_float16 (__main__.TestUnaryUfuncsCPU) ... ok
test_non_contig_expand_neg_cpu_float32 (__main__.TestUnaryUfuncsCPU) ... ok
test_non_contig_expand_neg_cpu_float64 (__main__.TestUnaryUfuncsCPU) ... ok
test_non_contig_expand_neg_cpu_int16 (__main__.TestUnaryUfuncsCPU) ... ok
test_non_contig_expand_neg_cpu_int32 (__main__.TestUnaryUfuncsCPU) ... ok
test_non_contig_expand_neg_cpu_int64 (__main__.TestUnaryUfuncsCPU) ... ok
test_non_contig_expand_neg_cpu_int8 (__main__.TestUnaryUfuncsCPU) ... ok
test_non_contig_expand_neg_cpu_uint8 (__main__.TestUnaryUfuncsCPU) ... ok
test_non_contig_expand_sin_cpu_bfloat16 (__main__.TestUnaryUfuncsCPU) ... ok
test_non_contig_expand_sin_cpu_complex128 (__main__.TestUnaryUfuncsCPU) ... ok
test_non_contig_expand_sin_cpu_complex64 (__main__.TestUnaryUfuncsCPU) ... ok
test_non_contig_expand_sin_cpu_float32 (__main__.TestUnaryUfuncsCPU) ... ok
test_non_contig_expand_sin_cpu_float64 (__main__.TestUnaryUfuncsCPU) ... ok
test_non_contig_expand_sinh_cpu_complex128 (__main__.TestUnaryUfuncsCPU) ... ok
test_non_contig_expand_sinh_cpu_complex64 (__main__.TestUnaryUfuncsCPU) ... ok
test_non_contig_expand_sinh_cpu_float32 (__main__.TestUnaryUfuncsCPU) ... ok
test_non_contig_expand_sinh_cpu_float64 (__main__.TestUnaryUfuncsCPU) ... ok
test_non_contig_expand_tan_cpu_bfloat16 (__main__.TestUnaryUfuncsCPU) ... ok
test_non_contig_expand_tan_cpu_complex128 (__main__.TestUnaryUfuncsCPU) ... ok
test_non_contig_expand_tan_cpu_complex64 (__main__.TestUnaryUfuncsCPU) ... ok
test_non_contig_expand_tan_cpu_float32 (__main__.TestUnaryUfuncsCPU) ... ok
test_non_contig_expand_tan_cpu_float64 (__main__.TestUnaryUfuncsCPU) ... ok
test_non_contig_expand_tanh_cpu_bfloat16 (__main__.TestUnaryUfuncsCPU) ... ok
test_non_contig_expand_tanh_cpu_complex128 (__main__.TestUnaryUfuncsCPU) ... ok
test_non_contig_expand_tanh_cpu_complex64 (__main__.TestUnaryUfuncsCPU) ... ok
test_non_contig_expand_tanh_cpu_float32 (__main__.TestUnaryUfuncsCPU) ... ok
test_non_contig_expand_tanh_cpu_float64 (__main__.TestUnaryUfuncsCPU) ... ok
test_non_contig_index_acos_cpu_bfloat16 (__main__.TestUnaryUfuncsCPU) ... ok
test_non_contig_index_acos_cpu_complex128 (__main__.TestUnaryUfuncsCPU) ... ok
test_non_contig_index_acos_cpu_complex64 (__main__.TestUnaryUfuncsCPU) ... ok
test_non_contig_index_acos_cpu_float32 (__main__.TestUnaryUfuncsCPU) ... ok
test_non_contig_index_acos_cpu_float64 (__main__.TestUnaryUfuncsCPU) ... ok
test_non_contig_index_acosh_cpu_float32 (__main__.TestUnaryUfuncsCPU) ... ok
test_non_contig_index_acosh_cpu_float64 (__main__.TestUnaryUfuncsCPU) ... ok
test_non_contig_index_asin_cpu_bfloat16 (__main__.TestUnaryUfuncsCPU) ... ok
test_non_contig_index_asin_cpu_complex128 (__main__.TestUnaryUfuncsCPU) ... ok
test_non_contig_index_asin_cpu_complex64 (__main__.TestUnaryUfuncsCPU) ... ok
test_non_contig_index_asin_cpu_float32 (__main__.TestUnaryUfuncsCPU) ... ok
test_non_contig_index_asin_cpu_float64 (__main__.TestUnaryUfuncsCPU) ... ok
test_non_contig_index_asinh_cpu_float32 (__main__.TestUnaryUfuncsCPU) ... ok
test_non_contig_index_asinh_cpu_float64 (__main__.TestUnaryUfuncsCPU) ... ok
test_non_contig_index_atan_cpu_bfloat16 (__main__.TestUnaryUfuncsCPU) ... ok
test_non_contig_index_atan_cpu_complex128 (__main__.TestUnaryUfuncsCPU) ... ok
test_non_contig_index_atan_cpu_complex64 (__main__.TestUnaryUfuncsCPU) ... ok
test_non_contig_index_atan_cpu_float32 (__main__.TestUnaryUfuncsCPU) ... ok
test_non_contig_index_atan_cpu_float64 (__main__.TestUnaryUfuncsCPU) ... ok
test_non_contig_index_atanh_cpu_float32 (__main__.TestUnaryUfuncsCPU) ... ok
test_non_contig_index_atanh_cpu_float64 (__main__.TestUnaryUfuncsCPU) ... ok
test_non_contig_index_cos_cpu_bfloat16 (__main__.TestUnaryUfuncsCPU) ... ok
test_non_contig_index_cos_cpu_complex128 (__main__.TestUnaryUfuncsCPU) ... ok
test_non_contig_index_cos_cpu_complex64 (__main__.TestUnaryUfuncsCPU) ... ok
test_non_contig_index_cos_cpu_float32 (__main__.TestUnaryUfuncsCPU) ... ok
test_non_contig_index_cos_cpu_float64 (__main__.TestUnaryUfuncsCPU) ... ok
test_non_contig_index_cosh_cpu_complex128 (__main__.TestUnaryUfuncsCPU) ... ok
test_non_contig_index_cosh_cpu_complex64 (__main__.TestUnaryUfuncsCPU) ... ok
test_non_contig_index_cosh_cpu_float32 (__main__.TestUnaryUfuncsCPU) ... ok
test_non_contig_index_cosh_cpu_float64 (__main__.TestUnaryUfuncsCPU) ... ok
test_non_contig_index_exp2_cpu_float16 (__main__.TestUnaryUfuncsCPU) ... ok
test_non_contig_index_exp2_cpu_float32 (__main__.TestUnaryUfuncsCPU) ... ok
test_non_contig_index_exp2_cpu_float64 (__main__.TestUnaryUfuncsCPU) ... ok
test_non_contig_index_log10_cpu_bfloat16 (__main__.TestUnaryUfuncsCPU) ... ok
test_non_contig_index_log10_cpu_complex128 (__main__.TestUnaryUfuncsCPU) ... ok
test_non_contig_index_log10_cpu_complex64 (__main__.TestUnaryUfuncsCPU) ... ok
test_non_contig_index_log10_cpu_float32 (__main__.TestUnaryUfuncsCPU) ... ok
test_non_contig_index_log10_cpu_float64 (__main__.TestUnaryUfuncsCPU) ... ok
test_non_contig_index_log1p_cpu_bfloat16 (__main__.TestUnaryUfuncsCPU) ... ok
test_non_contig_index_log1p_cpu_float32 (__main__.TestUnaryUfuncsCPU) ... ok
test_non_contig_index_log1p_cpu_float64 (__main__.TestUnaryUfuncsCPU) ... ok
test_non_contig_index_log2_cpu_bfloat16 (__main__.TestUnaryUfuncsCPU) ... ok
test_non_contig_index_log2_cpu_complex128 (__main__.TestUnaryUfuncsCPU) ... ok
test_non_contig_index_log2_cpu_complex64 (__main__.TestUnaryUfuncsCPU) ... ok
test_non_contig_index_log2_cpu_float32 (__main__.TestUnaryUfuncsCPU) ... ok
test_non_contig_index_log2_cpu_float64 (__main__.TestUnaryUfuncsCPU) ... ok
test_non_contig_index_log_cpu_bfloat16 (__main__.TestUnaryUfuncsCPU) ... ok
test_non_contig_index_log_cpu_complex128 (__main__.TestUnaryUfuncsCPU) ... ok
test_non_contig_index_log_cpu_complex64 (__main__.TestUnaryUfuncsCPU) ... ok
test_non_contig_index_log_cpu_float32 (__main__.TestUnaryUfuncsCPU) ... ok
test_non_contig_index_log_cpu_float64 (__main__.TestUnaryUfuncsCPU) ... ok
test_non_contig_index_neg_cpu_bfloat16 (__main__.TestUnaryUfuncsCPU) ... ok
test_non_contig_index_neg_cpu_complex128 (__main__.TestUnaryUfuncsCPU) ... ok
test_non_contig_index_neg_cpu_complex64 (__main__.TestUnaryUfuncsCPU) ... ok
test_non_contig_index_neg_cpu_float16 (__main__.TestUnaryUfuncsCPU) ... ok
test_non_contig_index_neg_cpu_float32 (__main__.TestUnaryUfuncsCPU) ... ok
test_non_contig_index_neg_cpu_float64 (__main__.TestUnaryUfuncsCPU) ... ok
test_non_contig_index_neg_cpu_int16 (__main__.TestUnaryUfuncsCPU) ... ok
test_non_contig_index_neg_cpu_int32 (__main__.TestUnaryUfuncsCPU) ... ok
test_non_contig_index_neg_cpu_int64 (__main__.TestUnaryUfuncsCPU) ... ok
test_non_contig_index_neg_cpu_int8 (__main__.TestUnaryUfuncsCPU) ... ok
test_non_contig_index_neg_cpu_uint8 (__main__.TestUnaryUfuncsCPU) ... ok
test_non_contig_index_sin_cpu_bfloat16 (__main__.TestUnaryUfuncsCPU) ... ok
test_non_contig_index_sin_cpu_complex128 (__main__.TestUnaryUfuncsCPU) ... ok
test_non_contig_index_sin_cpu_complex64 (__main__.TestUnaryUfuncsCPU) ... ok
test_non_contig_index_sin_cpu_float32 (__main__.TestUnaryUfuncsCPU) ... ok
test_non_contig_index_sin_cpu_float64 (__main__.TestUnaryUfuncsCPU) ... ok
test_non_contig_index_sinh_cpu_complex128 (__main__.TestUnaryUfuncsCPU) ... ok
test_non_contig_index_sinh_cpu_complex64 (__main__.TestUnaryUfuncsCPU) ... ok
test_non_contig_index_sinh_cpu_float32 (__main__.TestUnaryUfuncsCPU) ... ok
test_non_contig_index_sinh_cpu_float64 (__main__.TestUnaryUfuncsCPU) ... ok
test_non_contig_index_tan_cpu_bfloat16 (__main__.TestUnaryUfuncsCPU) ... ok
test_non_contig_index_tan_cpu_complex128 (__main__.TestUnaryUfuncsCPU) ... ok
test_non_contig_index_tan_cpu_complex64 (__main__.TestUnaryUfuncsCPU) ... ok
test_non_contig_index_tan_cpu_float32 (__main__.TestUnaryUfuncsCPU) ... ok
test_non_contig_index_tan_cpu_float64 (__main__.TestUnaryUfuncsCPU) ... ok
test_non_contig_index_tanh_cpu_bfloat16 (__main__.TestUnaryUfuncsCPU) ... ok
test_non_contig_index_tanh_cpu_complex128 (__main__.TestUnaryUfuncsCPU) ... ok
test_non_contig_index_tanh_cpu_complex64 (__main__.TestUnaryUfuncsCPU) ... ok
test_non_contig_index_tanh_cpu_float32 (__main__.TestUnaryUfuncsCPU) ... ok
test_non_contig_index_tanh_cpu_float64 (__main__.TestUnaryUfuncsCPU) ... ok
test_non_contig_log10_cpu_bfloat16 (__main__.TestUnaryUfuncsCPU) ... ok
test_non_contig_log10_cpu_complex128 (__main__.TestUnaryUfuncsCPU) ... ok
test_non_contig_log10_cpu_complex64 (__main__.TestUnaryUfuncsCPU) ... ok
test_non_contig_log10_cpu_float32 (__main__.TestUnaryUfuncsCPU) ... ok
test_non_contig_log10_cpu_float64 (__main__.TestUnaryUfuncsCPU) ... ok
test_non_contig_log1p_cpu_bfloat16 (__main__.TestUnaryUfuncsCPU) ... ok
test_non_contig_log1p_cpu_float32 (__main__.TestUnaryUfuncsCPU) ... ok
test_non_contig_log1p_cpu_float64 (__main__.TestUnaryUfuncsCPU) ... ok
test_non_contig_log2_cpu_bfloat16 (__main__.TestUnaryUfuncsCPU) ... ok
test_non_contig_log2_cpu_complex128 (__main__.TestUnaryUfuncsCPU) ... ok
test_non_contig_log2_cpu_complex64 (__main__.TestUnaryUfuncsCPU) ... ok
test_non_contig_log2_cpu_float32 (__main__.TestUnaryUfuncsCPU) ... ok
test_non_contig_log2_cpu_float64 (__main__.TestUnaryUfuncsCPU) ... ok
test_non_contig_log_cpu_bfloat16 (__main__.TestUnaryUfuncsCPU) ... ok
test_non_contig_log_cpu_complex128 (__main__.TestUnaryUfuncsCPU) ... ok
test_non_contig_log_cpu_complex64 (__main__.TestUnaryUfuncsCPU) ... ok
test_non_contig_log_cpu_float32 (__main__.TestUnaryUfuncsCPU) ... ok
test_non_contig_log_cpu_float64 (__main__.TestUnaryUfuncsCPU) ... ok
test_non_contig_neg_cpu_bfloat16 (__main__.TestUnaryUfuncsCPU) ... ok
test_non_contig_neg_cpu_complex128 (__main__.TestUnaryUfuncsCPU) ... ok
test_non_contig_neg_cpu_complex64 (__main__.TestUnaryUfuncsCPU) ... ok
test_non_contig_neg_cpu_float16 (__main__.TestUnaryUfuncsCPU) ... ok
test_non_contig_neg_cpu_float32 (__main__.TestUnaryUfuncsCPU) ... ok
test_non_contig_neg_cpu_float64 (__main__.TestUnaryUfuncsCPU) ... ok
test_non_contig_neg_cpu_int16 (__main__.TestUnaryUfuncsCPU) ... ok
test_non_contig_neg_cpu_int32 (__main__.TestUnaryUfuncsCPU) ... ok
test_non_contig_neg_cpu_int64 (__main__.TestUnaryUfuncsCPU) ... ok
test_non_contig_neg_cpu_int8 (__main__.TestUnaryUfuncsCPU) ... ok
test_non_contig_neg_cpu_uint8 (__main__.TestUnaryUfuncsCPU) ... ok
test_non_contig_sin_cpu_bfloat16 (__main__.TestUnaryUfuncsCPU) ... ok
test_non_contig_sin_cpu_complex128 (__main__.TestUnaryUfuncsCPU) ... ok
test_non_contig_sin_cpu_complex64 (__main__.TestUnaryUfuncsCPU) ... ok
test_non_contig_sin_cpu_float32 (__main__.TestUnaryUfuncsCPU) ... ok
test_non_contig_sin_cpu_float64 (__main__.TestUnaryUfuncsCPU) ... ok
test_non_contig_sinh_cpu_complex128 (__main__.TestUnaryUfuncsCPU) ... ok
test_non_contig_sinh_cpu_complex64 (__main__.TestUnaryUfuncsCPU) ... ok
test_non_contig_sinh_cpu_float32 (__main__.TestUnaryUfuncsCPU) ... ok
test_non_contig_sinh_cpu_float64 (__main__.TestUnaryUfuncsCPU) ... ok
test_non_contig_tan_cpu_bfloat16 (__main__.TestUnaryUfuncsCPU) ... ok
test_non_contig_tan_cpu_complex128 (__main__.TestUnaryUfuncsCPU) ... ok
test_non_contig_tan_cpu_complex64 (__main__.TestUnaryUfuncsCPU) ... ok
test_non_contig_tan_cpu_float32 (__main__.TestUnaryUfuncsCPU) ... ok
test_non_contig_tan_cpu_float64 (__main__.TestUnaryUfuncsCPU) ... ok
test_non_contig_tanh_cpu_bfloat16 (__main__.TestUnaryUfuncsCPU) ... ok
test_non_contig_tanh_cpu_complex128 (__main__.TestUnaryUfuncsCPU) ... ok
test_non_contig_tanh_cpu_complex64 (__main__.TestUnaryUfuncsCPU) ... ok
test_non_contig_tanh_cpu_float32 (__main__.TestUnaryUfuncsCPU) ... ok
test_non_contig_tanh_cpu_float64 (__main__.TestUnaryUfuncsCPU) ... ok
test_reference_numerics_acos_cpu_bfloat16 (__main__.TestUnaryUfuncsCPU) ... ok
test_reference_numerics_acos_cpu_complex128 (__main__.TestUnaryUfuncsCPU) ... skipped 'Skipped!'
test_reference_numerics_acos_cpu_complex64 (__main__.TestUnaryUfuncsCPU) ... skipped 'Skipped!'
test_reference_numerics_acos_cpu_float32 (__main__.TestUnaryUfuncsCPU) ... ok
test_reference_numerics_acos_cpu_float64 (__main__.TestUnaryUfuncsCPU) ... ok
test_reference_numerics_acosh_cpu_float32 (__main__.TestUnaryUfuncsCPU) ... ok
test_reference_numerics_acosh_cpu_float64 (__main__.TestUnaryUfuncsCPU) ... ok
test_reference_numerics_asin_cpu_bfloat16 (__main__.TestUnaryUfuncsCPU) ... ok
test_reference_numerics_asin_cpu_complex128 (__main__.TestUnaryUfuncsCPU) ... skipped 'Skipped!'
test_reference_numerics_asin_cpu_complex64 (__main__.TestUnaryUfuncsCPU) ... skipped 'Skipped!'
test_reference_numerics_asin_cpu_float32 (__main__.TestUnaryUfuncsCPU) ... ok
test_reference_numerics_asin_cpu_float64 (__main__.TestUnaryUfuncsCPU) ... ok
test_reference_numerics_asinh_cpu_float32 (__main__.TestUnaryUfuncsCPU) ... ok
test_reference_numerics_asinh_cpu_float64 (__main__.TestUnaryUfuncsCPU) ... ok
test_reference_numerics_atan_cpu_bfloat16 (__main__.TestUnaryUfuncsCPU) ... ok
test_reference_numerics_atan_cpu_complex128 (__main__.TestUnaryUfuncsCPU) ... skipped 'Skipped!'
test_reference_numerics_atan_cpu_complex64 (__main__.TestUnaryUfuncsCPU) ... skipped 'Skipped!'
test_reference_numerics_atan_cpu_float32 (__main__.TestUnaryUfuncsCPU) ... ok
test_reference_numerics_atan_cpu_float64 (__main__.TestUnaryUfuncsCPU) ... ok
test_reference_numerics_atanh_cpu_float32 (__main__.TestUnaryUfuncsCPU) ... ok
test_reference_numerics_atanh_cpu_float64 (__main__.TestUnaryUfuncsCPU) ... ok
test_reference_numerics_cos_cpu_bfloat16 (__main__.TestUnaryUfuncsCPU) ... ok
test_reference_numerics_cos_cpu_complex128 (__main__.TestUnaryUfuncsCPU) ... ok
test_reference_numerics_cos_cpu_complex64 (__main__.TestUnaryUfuncsCPU) ... ok
test_reference_numerics_cos_cpu_float32 (__main__.TestUnaryUfuncsCPU) ... ok
test_reference_numerics_cos_cpu_float64 (__main__.TestUnaryUfuncsCPU) ... ok
test_reference_numerics_cosh_cpu_complex128 (__main__.TestUnaryUfuncsCPU) ... ok
test_reference_numerics_cosh_cpu_complex64 (__main__.TestUnaryUfuncsCPU) ... ok
test_reference_numerics_cosh_cpu_float32 (__main__.TestUnaryUfuncsCPU) ... ok
test_reference_numerics_cosh_cpu_float64 (__main__.TestUnaryUfuncsCPU) ... ok
test_reference_numerics_exp2_cpu_float16 (__main__.TestUnaryUfuncsCPU) ... ok
test_reference_numerics_exp2_cpu_float32 (__main__.TestUnaryUfuncsCPU) ... ok
test_reference_numerics_exp2_cpu_float64 (__main__.TestUnaryUfuncsCPU) ... ok
test_reference_numerics_log10_cpu_bfloat16 (__main__.TestUnaryUfuncsCPU) ... ok
test_reference_numerics_log10_cpu_complex128 (__main__.TestUnaryUfuncsCPU) ... ok
test_reference_numerics_log10_cpu_complex64 (__main__.TestUnaryUfuncsCPU) ... ok
test_reference_numerics_log10_cpu_float32 (__main__.TestUnaryUfuncsCPU) ... ok
test_reference_numerics_log10_cpu_float64 (__main__.TestUnaryUfuncsCPU) ... ok
test_reference_numerics_log1p_cpu_bfloat16 (__main__.TestUnaryUfuncsCPU) ... ok
test_reference_numerics_log1p_cpu_float32 (__main__.TestUnaryUfuncsCPU) ... ok
test_reference_numerics_log1p_cpu_float64 (__main__.TestUnaryUfuncsCPU) ... ok
test_reference_numerics_log2_cpu_bfloat16 (__main__.TestUnaryUfuncsCPU) ... skipped 'Skipped!'
test_reference_numerics_log2_cpu_complex128 (__main__.TestUnaryUfuncsCPU) ... skipped 'Skipped!'
test_reference_numerics_log2_cpu_complex64 (__main__.TestUnaryUfuncsCPU) ... skipped 'Skipped!'
test_reference_numerics_log2_cpu_float32 (__main__.TestUnaryUfuncsCPU) ... ok
test_reference_numerics_log2_cpu_float64 (__main__.TestUnaryUfuncsCPU) ... ok
test_reference_numerics_log_cpu_bfloat16 (__main__.TestUnaryUfuncsCPU) ... skipped 'Skipped!'
test_reference_numerics_log_cpu_complex128 (__main__.TestUnaryUfuncsCPU) ... ok
test_reference_numerics_log_cpu_complex64 (__main__.TestUnaryUfuncsCPU) ... ok
test_reference_numerics_log_cpu_float32 (__main__.TestUnaryUfuncsCPU) ... ok
test_reference_numerics_log_cpu_float64 (__main__.TestUnaryUfuncsCPU) ... ok
test_reference_numerics_neg_cpu_bfloat16 (__main__.TestUnaryUfuncsCPU) ... ok
test_reference_numerics_neg_cpu_complex128 (__main__.TestUnaryUfuncsCPU) ... ok
test_reference_numerics_neg_cpu_complex64 (__main__.TestUnaryUfuncsCPU) ... ok
test_reference_numerics_neg_cpu_float16 (__main__.TestUnaryUfuncsCPU) ... ok
test_reference_numerics_neg_cpu_float32 (__main__.TestUnaryUfuncsCPU) ... ok
test_reference_numerics_neg_cpu_float64 (__main__.TestUnaryUfuncsCPU) ... ok
test_reference_numerics_neg_cpu_int16 (__main__.TestUnaryUfuncsCPU) ... ok
test_reference_numerics_neg_cpu_int32 (__main__.TestUnaryUfuncsCPU) ... ok
test_reference_numerics_neg_cpu_int64 (__main__.TestUnaryUfuncsCPU) ... ok
test_reference_numerics_neg_cpu_int8 (__main__.TestUnaryUfuncsCPU) ... ok
test_reference_numerics_neg_cpu_uint8 (__main__.TestUnaryUfuncsCPU) ... ok
test_reference_numerics_sin_cpu_bfloat16 (__main__.TestUnaryUfuncsCPU) ... ok
test_reference_numerics_sin_cpu_complex128 (__main__.TestUnaryUfuncsCPU) ... ok
test_reference_numerics_sin_cpu_complex64 (__main__.TestUnaryUfuncsCPU) ... ok
test_reference_numerics_sin_cpu_float32 (__main__.TestUnaryUfuncsCPU) ... ok
test_reference_numerics_sin_cpu_float64 (__main__.TestUnaryUfuncsCPU) ... ok
test_reference_numerics_sinh_cpu_complex128 (__main__.TestUnaryUfuncsCPU) ... ok
test_reference_numerics_sinh_cpu_complex64 (__main__.TestUnaryUfuncsCPU) ... ok
test_reference_numerics_sinh_cpu_float32 (__main__.TestUnaryUfuncsCPU) ... ok
test_reference_numerics_sinh_cpu_float64 (__main__.TestUnaryUfuncsCPU) ... ok
test_reference_numerics_tan_cpu_bfloat16 (__main__.TestUnaryUfuncsCPU) ... skipped 'Skipped!'
test_reference_numerics_tan_cpu_complex128 (__main__.TestUnaryUfuncsCPU) ... ok
test_reference_numerics_tan_cpu_complex64 (__main__.TestUnaryUfuncsCPU) ... ok
test_reference_numerics_tan_cpu_float32 (__main__.TestUnaryUfuncsCPU) ... ok
test_reference_numerics_tan_cpu_float64 (__main__.TestUnaryUfuncsCPU) ... ok
test_reference_numerics_tanh_cpu_bfloat16 (__main__.TestUnaryUfuncsCPU) ... ok
test_reference_numerics_tanh_cpu_complex128 (__main__.TestUnaryUfuncsCPU) ... ok
test_reference_numerics_tanh_cpu_complex64 (__main__.TestUnaryUfuncsCPU) ... ok
test_reference_numerics_tanh_cpu_float32 (__main__.TestUnaryUfuncsCPU) ... ok
test_reference_numerics_tanh_cpu_float64 (__main__.TestUnaryUfuncsCPU) ... ok
test_sqrt_complex_edge_values_cpu_complex128 (__main__.TestUnaryUfuncsCPU) ... ok
test_sqrt_complex_edge_values_cpu_complex64 (__main__.TestUnaryUfuncsCPU) ... ok
test_variant_consistency_acos_cpu_bfloat16 (__main__.TestUnaryUfuncsCPU) ... ok
test_variant_consistency_acos_cpu_complex128 (__main__.TestUnaryUfuncsCPU) ... ok
test_variant_consistency_acos_cpu_complex64 (__main__.TestUnaryUfuncsCPU) ... ok
test_variant_consistency_acos_cpu_float32 (__main__.TestUnaryUfuncsCPU) ... ok
test_variant_consistency_acos_cpu_float64 (__main__.TestUnaryUfuncsCPU) ... ok
test_variant_consistency_acosh_cpu_float32 (__main__.TestUnaryUfuncsCPU) ... ok
test_variant_consistency_acosh_cpu_float64 (__main__.TestUnaryUfuncsCPU) ... ok
test_variant_consistency_asin_cpu_bfloat16 (__main__.TestUnaryUfuncsCPU) ... ok
test_variant_consistency_asin_cpu_complex128 (__main__.TestUnaryUfuncsCPU) ... ok
test_variant_consistency_asin_cpu_complex64 (__main__.TestUnaryUfuncsCPU) ... ok
test_variant_consistency_asin_cpu_float32 (__main__.TestUnaryUfuncsCPU) ... ok
test_variant_consistency_asin_cpu_float64 (__main__.TestUnaryUfuncsCPU) ... ok
test_variant_consistency_asinh_cpu_float32 (__main__.TestUnaryUfuncsCPU) ... ok
test_variant_consistency_asinh_cpu_float64 (__main__.TestUnaryUfuncsCPU) ... ok
test_variant_consistency_atan_cpu_bfloat16 (__main__.TestUnaryUfuncsCPU) ... ok
test_variant_consistency_atan_cpu_complex128 (__main__.TestUnaryUfuncsCPU) ... ok
test_variant_consistency_atan_cpu_complex64 (__main__.TestUnaryUfuncsCPU) ... ok
test_variant_consistency_atan_cpu_float32 (__main__.TestUnaryUfuncsCPU) ... ok
test_variant_consistency_atan_cpu_float64 (__main__.TestUnaryUfuncsCPU) ... ok
test_variant_consistency_atanh_cpu_float32 (__main__.TestUnaryUfuncsCPU) ... ok
test_variant_consistency_atanh_cpu_float64 (__main__.TestUnaryUfuncsCPU) ... ok
test_variant_consistency_cos_cpu_bfloat16 (__main__.TestUnaryUfuncsCPU) ... ok
test_variant_consistency_cos_cpu_complex128 (__main__.TestUnaryUfuncsCPU) ... ok
test_variant_consistency_cos_cpu_complex64 (__main__.TestUnaryUfuncsCPU) ... ok
test_variant_consistency_cos_cpu_float32 (__main__.TestUnaryUfuncsCPU) ... ok
test_variant_consistency_cos_cpu_float64 (__main__.TestUnaryUfuncsCPU) ... ok
test_variant_consistency_cosh_cpu_complex128 (__main__.TestUnaryUfuncsCPU) ... ok
test_variant_consistency_cosh_cpu_complex64 (__main__.TestUnaryUfuncsCPU) ... ok
test_variant_consistency_cosh_cpu_float32 (__main__.TestUnaryUfuncsCPU) ... ok
test_variant_consistency_cosh_cpu_float64 (__main__.TestUnaryUfuncsCPU) ... ok
test_variant_consistency_exp2_cpu_float16 (__main__.TestUnaryUfuncsCPU) ... ok
test_variant_consistency_exp2_cpu_float32 (__main__.TestUnaryUfuncsCPU) ... ok
test_variant_consistency_exp2_cpu_float64 (__main__.TestUnaryUfuncsCPU) ... ok
test_variant_consistency_log10_cpu_bfloat16 (__main__.TestUnaryUfuncsCPU) ... ok
test_variant_consistency_log10_cpu_complex128 (__main__.TestUnaryUfuncsCPU) ... ok
test_variant_consistency_log10_cpu_complex64 (__main__.TestUnaryUfuncsCPU) ... ok
test_variant_consistency_log10_cpu_float32 (__main__.TestUnaryUfuncsCPU) ... ok
test_variant_consistency_log10_cpu_float64 (__main__.TestUnaryUfuncsCPU) ... ok
test_variant_consistency_log1p_cpu_bfloat16 (__main__.TestUnaryUfuncsCPU) ... ok
test_variant_consistency_log1p_cpu_float32 (__main__.TestUnaryUfuncsCPU) ... ok
test_variant_consistency_log1p_cpu_float64 (__main__.TestUnaryUfuncsCPU) ... ok
test_variant_consistency_log2_cpu_bfloat16 (__main__.TestUnaryUfuncsCPU) ... ok
test_variant_consistency_log2_cpu_complex128 (__main__.TestUnaryUfuncsCPU) ... ok
test_variant_consistency_log2_cpu_complex64 (__main__.TestUnaryUfuncsCPU) ... ok
test_variant_consistency_log2_cpu_float32 (__main__.TestUnaryUfuncsCPU) ... ok
test_variant_consistency_log2_cpu_float64 (__main__.TestUnaryUfuncsCPU) ... ok
test_variant_consistency_log_cpu_bfloat16 (__main__.TestUnaryUfuncsCPU) ... ok
test_variant_consistency_log_cpu_complex128 (__main__.TestUnaryUfuncsCPU) ... ok
test_variant_consistency_log_cpu_complex64 (__main__.TestUnaryUfuncsCPU) ... ok
test_variant_consistency_log_cpu_float32 (__main__.TestUnaryUfuncsCPU) ... ok
test_variant_consistency_log_cpu_float64 (__main__.TestUnaryUfuncsCPU) ... ok
test_variant_consistency_neg_cpu_bfloat16 (__main__.TestUnaryUfuncsCPU) ... ok
test_variant_consistency_neg_cpu_complex128 (__main__.TestUnaryUfuncsCPU) ... ok
test_variant_consistency_neg_cpu_complex64 (__main__.TestUnaryUfuncsCPU) ... ok
test_variant_consistency_neg_cpu_float16 (__main__.TestUnaryUfuncsCPU) ... ok
test_variant_consistency_neg_cpu_float32 (__main__.TestUnaryUfuncsCPU) ... ok
test_variant_consistency_neg_cpu_float64 (__main__.TestUnaryUfuncsCPU) ... ok
test_variant_consistency_neg_cpu_int16 (__main__.TestUnaryUfuncsCPU) ... ok
test_variant_consistency_neg_cpu_int32 (__main__.TestUnaryUfuncsCPU) ... ok
test_variant_consistency_neg_cpu_int64 (__main__.TestUnaryUfuncsCPU) ... ok
test_variant_consistency_neg_cpu_int8 (__main__.TestUnaryUfuncsCPU) ... ok
test_variant_consistency_neg_cpu_uint8 (__main__.TestUnaryUfuncsCPU) ... ok
test_variant_consistency_sin_cpu_bfloat16 (__main__.TestUnaryUfuncsCPU) ... ok
test_variant_consistency_sin_cpu_complex128 (__main__.TestUnaryUfuncsCPU) ... ok
test_variant_consistency_sin_cpu_complex64 (__main__.TestUnaryUfuncsCPU) ... ok
test_variant_consistency_sin_cpu_float32 (__main__.TestUnaryUfuncsCPU) ... ok
test_variant_consistency_sin_cpu_float64 (__main__.TestUnaryUfuncsCPU) ... ok
test_variant_consistency_sinh_cpu_complex128 (__main__.TestUnaryUfuncsCPU) ... ok
test_variant_consistency_sinh_cpu_complex64 (__main__.TestUnaryUfuncsCPU) ... ok
test_variant_consistency_sinh_cpu_float32 (__main__.TestUnaryUfuncsCPU) ... ok
test_variant_consistency_sinh_cpu_float64 (__main__.TestUnaryUfuncsCPU) ... ok
test_variant_consistency_tan_cpu_bfloat16 (__main__.TestUnaryUfuncsCPU) ... ok
test_variant_consistency_tan_cpu_complex128 (__main__.TestUnaryUfuncsCPU) ... ok
test_variant_consistency_tan_cpu_complex64 (__main__.TestUnaryUfuncsCPU) ... ok
test_variant_consistency_tan_cpu_float32 (__main__.TestUnaryUfuncsCPU) ... ok
test_variant_consistency_tan_cpu_float64 (__main__.TestUnaryUfuncsCPU) ... ok
test_variant_consistency_tanh_cpu_bfloat16 (__main__.TestUnaryUfuncsCPU) ... ok
test_variant_consistency_tanh_cpu_complex128 (__main__.TestUnaryUfuncsCPU) ... ok
test_variant_consistency_tanh_cpu_complex64 (__main__.TestUnaryUfuncsCPU) ... ok
test_variant_consistency_tanh_cpu_float32 (__main__.TestUnaryUfuncsCPU) ... ok
test_variant_consistency_tanh_cpu_float64 (__main__.TestUnaryUfuncsCPU) ... ok

----------------------------------------------------------------------
Ran 845 tests in 38.268s

OK (skipped=21)
Running test_utils ... [2021-05-04 19:48:25.362524]
Executing ['/scratch/ws/1/s3248973-EasyBuild/easybuild-ml/software/Python/3.8.6-GCCcore-10.2.0/bin/python', 'test_utils.py', '--verbose'] ... [2021-05-04 19:48:25.362600]
test_assert_true (__main__.TestAssert) ... ok
test_adaptive_timer (__main__.TestBenchmarkUtils) ... ok
test_collect_callgrind (__main__.TestBenchmarkUtils) ... skipped 'test is slow; run with PYTORCH_TEST_WITH_SLOW to enable test'
test_compare (__main__.TestBenchmarkUtils) ... ok
test_fuzzer (__main__.TestBenchmarkUtils) ... ok
test_timer (__main__.TestBenchmarkUtils) ... ok
test_bottleneck_cpu_only (__main__.TestBottleneck) ... FAIL
test_bottleneck_cuda (__main__.TestBottleneck) ... skipped 'No CUDA'
test_checkpoint (__main__.TestCheckpoint) ... ok
test_checkpoint_module_list (__main__.TestCheckpoint) ... ok
test_checkpoint_non_tensor (__main__.TestCheckpoint) ... ok
test_checkpoint_rng_cpu (__main__.TestCheckpoint) ... ok
test_checkpoint_rng_cuda (__main__.TestCheckpoint) ... skipped 'No CUDA'
test_checkpoint_sequential_deprecated_multiple_args (__main__.TestCheckpoint) ... ok
test_checkpoint_sequential_deprecated_no_args (__main__.TestCheckpoint) ... ok
test_checkpoint_trigger (__main__.TestCheckpoint) ... ok
test_checkpoint_valid (__main__.TestCheckpoint) ... ok
test_smoke (__main__.TestCollectEnv) ... ok
test_multi_drop (__main__.TestDataLoader) ... ok
test_multi_keep (__main__.TestDataLoader) ... skipped 'FIXME: Intermittent CUDA out-of-memory error on Windows and time-out under ASAN'
test_random_seed (__main__.TestDataLoader) ... ok
test_single_drop (__main__.TestDataLoader) ... ok
test_single_keep (__main__.TestDataLoader) ... ok
test_deprecated (__main__.TestFFI) ... ok
test_import_hipify (__main__.TestHipify) ... ok
test_download_url_to_file (__main__.TestHub) ... skipped 'Sandcastle cannot ping external'
test_hub_dir (__main__.TestHub) ... skipped 'Sandcastle cannot ping external'
test_list_entrypoints (__main__.TestHub) ... skipped 'Sandcastle cannot ping external'
test_load_from_branch (__main__.TestHub) ... skipped 'Sandcastle cannot ping external'
test_load_from_github (__main__.TestHub) ... skipped 'Sandcastle cannot ping external'
test_load_from_local_dir (__main__.TestHub) ... skipped 'Sandcastle cannot ping external'
test_load_state_dict_from_url (__main__.TestHub) ... skipped 'Sandcastle cannot ping external'
test_load_state_dict_from_url_with_name (__main__.TestHub) ... skipped 'Sandcastle cannot ping external'
test_load_zip_1_6_checkpoint (__main__.TestHub) ... skipped 'Sandcastle cannot ping external'
test_load_zip_checkpoint (__main__.TestHub) ... skipped 'Sandcastle cannot ping external'
test_set_dir (__main__.TestHub) ... skipped 'Sandcastle cannot ping external'
test_check_onnx_broadcast (__main__.TestONNXUtils) ... ok
test_prepare_onnx_paddings (__main__.TestONNXUtils) ... ok

======================================================================
FAIL: test_bottleneck_cpu_only (__main__.TestBottleneck)
----------------------------------------------------------------------
Traceback (most recent call last):
  File "test_utils.py", line 412, in test_bottleneck_cpu_only
    self.assertEqual(rc, 0, msg='Run failed with\n{}'.format(err))
  File "/tmp/easybuild-tmp/eb-6TjmmG/tmpZ43OeA/lib/python3.8/site-packages/torch/testing/_internal/common_utils.py", line 1173, in assertEqual
    self.assertTrue(result, msg=msg)
AssertionError: False is not true : Run failed with


----------------------------------------------------------------------
Ran 38 tests in 34.444s

FAILED (failures=1, skipped=15)
Traceback (most recent call last):
  File "run_test.py", line 745, in 
    main()
  File "run_test.py", line 728, in main
    raise RuntimeError(err_message)
RuntimeError: test_utils failed!
 (at easybuild/tools/run.py:564 in parse_cmd_output)
== 2021-05-04 19:49:01,619 easyblock.py:3427 WARNING build failed (first 300 chars): cmd "export PYTHONPATH=/tmp/easybuild-tmp/eb-6TjmmG/tmpZ43OeA/lib/python3.8/site-packages:$PYTHONPATH &&  cd test && PYTHONUNBUFFERED=1 /scratch/ws/1/s3248973-EasyBuild/easybuild-ml/software/Python/3.8.6-GCCcore-10.2.0/bin/python run_test.py --verbose -x distributed/rpc/test_process_group_agent test
== 2021-05-04 19:49:01,619 easyblock.py:298 INFO Closing log for application name PyTorch version 1.7.1

Leave a Reply

Your email address will not be published. Required fields are marked *