PR-14916

Home   »   PR-14916

Determining if the pthread_create exist failed with the following output:
Change Dir: /home/centos/smoketest/PR-14916/build/CMakeFiles/CMakeTmp

Run Build Command:"/opt/rh/devtoolset-7/root/usr/bin/gmake" "cmTC_6d901/fast"
/opt/rh/devtoolset-7/root/usr/bin/gmake -f CMakeFiles/cmTC_6d901.dir/build.make CMakeFiles/cmTC_6d901.dir/build
gmake[1]: Entering directory '/home/centos/smoketest/PR-14916/build/CMakeFiles/CMakeTmp'
Building C object CMakeFiles/cmTC_6d901.dir/CheckSymbolExists.c.o
/opt/rh/devtoolset-7/root/usr/bin/cc    -o CMakeFiles/cmTC_6d901.dir/CheckSymbolExists.c.o   -c /home/centos/smoketest/PR-14916/build/CMakeFiles/CMakeTmp/CheckSymbolExists.c
Linking C executable cmTC_6d901
/usr/local/bin/cmake -E cmake_link_script CMakeFiles/cmTC_6d901.dir/link.txt --verbose=1
/opt/rh/devtoolset-7/root/usr/bin/cc      CMakeFiles/cmTC_6d901.dir/CheckSymbolExists.c.o  -o cmTC_6d901 
CMakeFiles/cmTC_6d901.dir/CheckSymbolExists.c.o: In function `main':
CheckSymbolExists.c:(.text+0x16): undefined reference to `pthread_create'
collect2: error: ld returned 1 exit status
gmake[1]: *** [CMakeFiles/cmTC_6d901.dir/build.make:87: cmTC_6d901] Error 1
gmake[1]: Leaving directory '/home/centos/smoketest/PR-14916/build/CMakeFiles/CMakeTmp'
gmake: *** [Makefile:121: cmTC_6d901/fast] Error 2

File /home/centos/smoketest/PR-14916/build/CMakeFiles/CMakeTmp/CheckSymbolExists.c:
/* */
#include 

int main(int argc, char** argv)
{
  (void)argv;
#ifndef pthread_create
  return ((int*)(&pthread_create))[argc];
#else
  (void)argc;
  return 0;
#endif
}

Determining if the function pthread_create exists in the pthreads failed with the following output:
Change Dir: /home/centos/smoketest/PR-14916/build/CMakeFiles/CMakeTmp

Run Build Command:"/opt/rh/devtoolset-7/root/usr/bin/gmake" "cmTC_e8670/fast"
/opt/rh/devtoolset-7/root/usr/bin/gmake -f CMakeFiles/cmTC_e8670.dir/build.make CMakeFiles/cmTC_e8670.dir/build
gmake[1]: Entering directory '/home/centos/smoketest/PR-14916/build/CMakeFiles/CMakeTmp'
Building C object CMakeFiles/cmTC_e8670.dir/CheckFunctionExists.c.o
/opt/rh/devtoolset-7/root/usr/bin/cc   -DCHECK_FUNCTION_EXISTS=pthread_create   -o CMakeFiles/cmTC_e8670.dir/CheckFunctionExists.c.o   -c /usr/local/share/cmake-3.13/Modules/CheckFunctionExists.c
Linking C executable cmTC_e8670
/usr/local/bin/cmake -E cmake_link_script CMakeFiles/cmTC_e8670.dir/link.txt --verbose=1
/opt/rh/devtoolset-7/root/usr/bin/cc  -DCHECK_FUNCTION_EXISTS=pthread_create    CMakeFiles/cmTC_e8670.dir/CheckFunctionExists.c.o  -o cmTC_e8670 -lpthreads 
/opt/rh/devtoolset-7/root/usr/libexec/gcc/x86_64-redhat-linux/7/ld: cannot find -lpthreads
collect2: error: ld returned 1 exit status
gmake[1]: *** [CMakeFiles/cmTC_e8670.dir/build.make:87: cmTC_e8670] Error 1
gmake[1]: Leaving directory '/home/centos/smoketest/PR-14916/build/CMakeFiles/CMakeTmp'
gmake: *** [Makefile:121: cmTC_e8670/fast] Error 2


Determining if the include file bsd/stdlib.h exists failed with the following output:
Change Dir: /home/centos/smoketest/PR-14916/build/CMakeFiles/CMakeTmp

Run Build Command:"/opt/rh/devtoolset-7/root/usr/bin/gmake" "cmTC_97a84/fast"
/opt/rh/devtoolset-7/root/usr/bin/gmake -f CMakeFiles/cmTC_97a84.dir/build.make CMakeFiles/cmTC_97a84.dir/build
gmake[1]: Entering directory '/home/centos/smoketest/PR-14916/build/CMakeFiles/CMakeTmp'
Building C object CMakeFiles/cmTC_97a84.dir/CheckIncludeFile.c.o
/opt/rh/devtoolset-7/root/usr/bin/cc -D_GNU_SOURCE  -std=c11 -o CMakeFiles/cmTC_97a84.dir/CheckIncludeFile.c.o   -c /home/centos/smoketest/PR-14916/build/CMakeFiles/CMakeTmp/CheckIncludeFile.c
/home/centos/smoketest/PR-14916/build/CMakeFiles/CMakeTmp/CheckIncludeFile.c:1:10: fatal error: bsd/stdlib.h: No such file or directory
 #include 
          ^~~~~~~~~~~~~~
compilation terminated.
gmake[1]: *** [CMakeFiles/cmTC_97a84.dir/build.make:66: CMakeFiles/cmTC_97a84.dir/CheckIncludeFile.c.o] Error 1
gmake[1]: Leaving directory '/home/centos/smoketest/PR-14916/build/CMakeFiles/CMakeTmp'
gmake: *** [Makefile:121: cmTC_97a84/fast] Error 2


Determining if the arc4random exist failed with the following output:
Change Dir: /home/centos/smoketest/PR-14916/build/CMakeFiles/CMakeTmp

Run Build Command:"/opt/rh/devtoolset-7/root/usr/bin/gmake" "cmTC_ed157/fast"
/opt/rh/devtoolset-7/root/usr/bin/gmake -f CMakeFiles/cmTC_ed157.dir/build.make CMakeFiles/cmTC_ed157.dir/build
gmake[1]: Entering directory '/home/centos/smoketest/PR-14916/build/CMakeFiles/CMakeTmp'
Building C object CMakeFiles/cmTC_ed157.dir/CheckSymbolExists.c.o
/opt/rh/devtoolset-7/root/usr/bin/cc -D_GNU_SOURCE  -std=c11 -o CMakeFiles/cmTC_ed157.dir/CheckSymbolExists.c.o   -c /home/centos/smoketest/PR-14916/build/CMakeFiles/CMakeTmp/CheckSymbolExists.c
/home/centos/smoketest/PR-14916/build/CMakeFiles/CMakeTmp/CheckSymbolExists.c: In function ‘main’:
/home/centos/smoketest/PR-14916/build/CMakeFiles/CMakeTmp/CheckSymbolExists.c:8:19: error: ‘arc4random’ undeclared (first use in this function); did you mean ‘srandom’?
   return ((int*)(&arc4random))[argc];
                   ^~~~~~~~~~
                   srandom
/home/centos/smoketest/PR-14916/build/CMakeFiles/CMakeTmp/CheckSymbolExists.c:8:19: note: each undeclared identifier is reported only once for each function it appears in
gmake[1]: *** [CMakeFiles/cmTC_ed157.dir/build.make:66: CMakeFiles/cmTC_ed157.dir/CheckSymbolExists.c.o] Error 1
gmake[1]: Leaving directory '/home/centos/smoketest/PR-14916/build/CMakeFiles/CMakeTmp'
gmake: *** [Makefile:121: cmTC_ed157/fast] Error 2

File /home/centos/smoketest/PR-14916/build/CMakeFiles/CMakeTmp/CheckSymbolExists.c:
/* */
#include 

int main(int argc, char** argv)
{
  (void)argv;
#ifndef arc4random
  return ((int*)(&arc4random))[argc];
#else
  (void)argc;
  return 0;
#endif
}

Performing C++ SOURCE FILE Test HAVE_UNORDERED_MAP failed with the following output:
Change Dir: /home/centos/smoketest/PR-14916/build/CMakeFiles/CMakeTmp

Run Build Command:"/opt/rh/devtoolset-7/root/usr/bin/gmake" "cmTC_7f7db/fast"
/opt/rh/devtoolset-7/root/usr/bin/gmake -f CMakeFiles/cmTC_7f7db.dir/build.make CMakeFiles/cmTC_7f7db.dir/build
gmake[1]: Entering directory '/home/centos/smoketest/PR-14916/build/CMakeFiles/CMakeTmp'
Building CXX object CMakeFiles/cmTC_7f7db.dir/src.cxx.o
/opt/rh/devtoolset-7/root/usr/bin/c++    -frtti -fPIC -fmessage-length=0 -Werror=format -Wformat-security -Wformat-nonliteral -pthread -Wuninitialized -Werror=return-type -Werror=format-nonliteral -Wno-psabi -Wparentheses -std=c++11 -DHAVE_UNORDERED_MAP  -std=c++11   -o CMakeFiles/cmTC_7f7db.dir/src.cxx.o -c /home/centos/smoketest/PR-14916/build/CMakeFiles/CMakeTmp/src.cxx
/home/centos/smoketest/PR-14916/build/CMakeFiles/CMakeTmp/src.cxx: In function ‘int main()’:
/home/centos/smoketest/PR-14916/build/CMakeFiles/CMakeTmp/src.cxx:4:14: error: ‘std::tr1’ has not been declared
         std::tr1::unordered_map m;
              ^~~
/home/centos/smoketest/PR-14916/build/CMakeFiles/CMakeTmp/src.cxx:4:33: error: expected primary-expression before ‘int’
         std::tr1::unordered_map m;
                                 ^~~
/home/centos/smoketest/PR-14916/build/CMakeFiles/CMakeTmp/src.cxx:5:16: error: ‘m’ was not declared in this scope
         return m.find(42) == m.end();
                ^
/home/centos/smoketest/PR-14916/build/CMakeFiles/CMakeTmp/src.cxx:5:16: note: suggested alternative: ‘tm’
         return m.find(42) == m.end();
                ^
                tm
gmake[1]: *** [CMakeFiles/cmTC_7f7db.dir/build.make:66: CMakeFiles/cmTC_7f7db.dir/src.cxx.o] Error 1
gmake[1]: Leaving directory '/home/centos/smoketest/PR-14916/build/CMakeFiles/CMakeTmp'
gmake: *** [Makefile:121: cmTC_7f7db/fast] Error 2

Source file was:

      #include 
      int main() {
        std::tr1::unordered_map m;
        return m.find(42) == m.end();
      }
      
Determining if the SO_NOSIGPIPE exist failed with the following output:
Change Dir: /home/centos/smoketest/PR-14916/build/CMakeFiles/CMakeTmp

Run Build Command:"/opt/rh/devtoolset-7/root/usr/bin/gmake" "cmTC_ceba7/fast"
/opt/rh/devtoolset-7/root/usr/bin/gmake -f CMakeFiles/cmTC_ceba7.dir/build.make CMakeFiles/cmTC_ceba7.dir/build
gmake[1]: Entering directory '/home/centos/smoketest/PR-14916/build/CMakeFiles/CMakeTmp'
Building C object CMakeFiles/cmTC_ceba7.dir/CheckSymbolExists.c.o
/opt/rh/devtoolset-7/root/usr/bin/cc   -D_GNU_SOURCE    -o CMakeFiles/cmTC_ceba7.dir/CheckSymbolExists.c.o   -c /home/centos/smoketest/PR-14916/build/CMakeFiles/CMakeTmp/CheckSymbolExists.c
/home/centos/smoketest/PR-14916/build/CMakeFiles/CMakeTmp/CheckSymbolExists.c: In function ‘main’:
/home/centos/smoketest/PR-14916/build/CMakeFiles/CMakeTmp/CheckSymbolExists.c:9:19: error: ‘SO_NOSIGPIPE’ undeclared (first use in this function); did you mean ‘SO_OOBINLINE’?
   return ((int*)(&SO_NOSIGPIPE))[argc];
                   ^~~~~~~~~~~~
                   SO_OOBINLINE
/home/centos/smoketest/PR-14916/build/CMakeFiles/CMakeTmp/CheckSymbolExists.c:9:19: note: each undeclared identifier is reported only once for each function it appears in
gmake[1]: *** [CMakeFiles/cmTC_ceba7.dir/build.make:66: CMakeFiles/cmTC_ceba7.dir/CheckSymbolExists.c.o] Error 1
gmake[1]: Leaving directory '/home/centos/smoketest/PR-14916/build/CMakeFiles/CMakeTmp'
gmake: *** [Makefile:121: cmTC_ceba7/fast] Error 2

File /home/centos/smoketest/PR-14916/build/CMakeFiles/CMakeTmp/CheckSymbolExists.c:
/* */
#include 
#include 

int main(int argc, char** argv)
{
  (void)argv;
#ifndef SO_NOSIGPIPE
  return ((int*)(&SO_NOSIGPIPE))[argc];
#else
  (void)argc;
  return 0;
#endif
}

The system is: Linux - 3.10.0-957.1.3.el7.x86_64 - x86_64
Compiling the C compiler identification source file "CMakeCCompilerId.c" succeeded.
Compiler: /opt/rh/devtoolset-7/root/usr/bin/cc 
Build flags: 
Id flags:  

The output was:
0


Compilation of the C compiler identification source "CMakeCCompilerId.c" produced "a.out"

The C compiler identification is GNU, found in "/home/centos/smoketest/PR-14916/build/CMakeFiles/3.13.1/CompilerIdC/a.out"

Compiling the CXX compiler identification source file "CMakeCXXCompilerId.cpp" succeeded.
Compiler: /opt/rh/devtoolset-7/root/usr/bin/c++ 
Build flags: 
Id flags:  

The output was:
0


Compilation of the CXX compiler identification source "CMakeCXXCompilerId.cpp" produced "a.out"

The CXX compiler identification is GNU, found in "/home/centos/smoketest/PR-14916/build/CMakeFiles/3.13.1/CompilerIdCXX/a.out"

Determining if the C compiler works passed with the following output:
Change Dir: /home/centos/smoketest/PR-14916/build/CMakeFiles/CMakeTmp

Run Build Command:"/opt/rh/devtoolset-7/root/usr/bin/gmake" "cmTC_97c2a/fast"
/opt/rh/devtoolset-7/root/usr/bin/gmake -f CMakeFiles/cmTC_97c2a.dir/build.make CMakeFiles/cmTC_97c2a.dir/build
gmake[1]: Entering directory '/home/centos/smoketest/PR-14916/build/CMakeFiles/CMakeTmp'
Building C object CMakeFiles/cmTC_97c2a.dir/testCCompiler.c.o
/opt/rh/devtoolset-7/root/usr/bin/cc    -o CMakeFiles/cmTC_97c2a.dir/testCCompiler.c.o   -c /home/centos/smoketest/PR-14916/build/CMakeFiles/CMakeTmp/testCCompiler.c
Linking C executable cmTC_97c2a
/usr/local/bin/cmake -E cmake_link_script CMakeFiles/cmTC_97c2a.dir/link.txt --verbose=1
/opt/rh/devtoolset-7/root/usr/bin/cc      -rdynamic CMakeFiles/cmTC_97c2a.dir/testCCompiler.c.o  -o cmTC_97c2a 
gmake[1]: Leaving directory '/home/centos/smoketest/PR-14916/build/CMakeFiles/CMakeTmp'


Detecting C compiler ABI info compiled with the following output:
Change Dir: /home/centos/smoketest/PR-14916/build/CMakeFiles/CMakeTmp

Run Build Command:"/opt/rh/devtoolset-7/root/usr/bin/gmake" "cmTC_10c20/fast"
/opt/rh/devtoolset-7/root/usr/bin/gmake -f CMakeFiles/cmTC_10c20.dir/build.make CMakeFiles/cmTC_10c20.dir/build
gmake[1]: Entering directory '/home/centos/smoketest/PR-14916/build/CMakeFiles/CMakeTmp'
Building C object CMakeFiles/cmTC_10c20.dir/CMakeCCompilerABI.c.o
/opt/rh/devtoolset-7/root/usr/bin/cc    -o CMakeFiles/cmTC_10c20.dir/CMakeCCompilerABI.c.o   -c /usr/local/share/cmake-3.13/Modules/CMakeCCompilerABI.c
Linking C executable cmTC_10c20
/usr/local/bin/cmake -E cmake_link_script CMakeFiles/cmTC_10c20.dir/link.txt --verbose=1
/opt/rh/devtoolset-7/root/usr/bin/cc     -v -rdynamic CMakeFiles/cmTC_10c20.dir/CMakeCCompilerABI.c.o  -o cmTC_10c20 
Using built-in specs.
COLLECT_GCC=/opt/rh/devtoolset-7/root/usr/bin/cc
COLLECT_LTO_WRAPPER=/opt/rh/devtoolset-7/root/usr/libexec/gcc/x86_64-redhat-linux/7/lto-wrapper
Target: x86_64-redhat-linux
Configured with: ../configure --enable-bootstrap --enable-languages=c,c++,fortran,lto --prefix=/opt/rh/devtoolset-7/root/usr --mandir=/opt/rh/devtoolset-7/root/usr/share/man --infodir=/opt/rh/devtoolset-7/root/usr/share/info --with-bugurl=http://bugzilla.redhat.com/bugzilla --enable-shared --enable-threads=posix --enable-checking=release --enable-multilib --with-system-zlib --enable-__cxa_atexit --disable-libunwind-exceptions --enable-gnu-unique-object --enable-linker-build-id --with-gcc-major-version-only --enable-plugin --with-linker-hash-style=gnu --enable-initfini-array --with-default-libstdcxx-abi=gcc4-compatible --with-isl=/builddir/build/BUILD/gcc-7.3.1-20180303/obj-x86_64-redhat-linux/isl-install --enable-libmpx --enable-gnu-indirect-function --with-tune=generic --with-arch_32=i686 --build=x86_64-redhat-linux
Thread model: posix
gcc version 7.3.1 20180303 (Red Hat 7.3.1-5) (GCC) 
COMPILER_PATH=/opt/rh/devtoolset-7/root/usr/libexec/gcc/x86_64-redhat-linux/7/:/opt/rh/devtoolset-7/root/usr/libexec/gcc/x86_64-redhat-linux/7/:/opt/rh/devtoolset-7/root/usr/libexec/gcc/x86_64-redhat-linux/:/opt/rh/devtoolset-7/root/usr/lib/gcc/x86_64-redhat-linux/7/:/opt/rh/devtoolset-7/root/usr/lib/gcc/x86_64-redhat-linux/
LIBRARY_PATH=/opt/rh/devtoolset-7/root/usr/lib/gcc/x86_64-redhat-linux/7/:/opt/rh/devtoolset-7/root/usr/lib/gcc/x86_64-redhat-linux/7/../../../../lib64/:/lib/../lib64/:/usr/lib/../lib64/:/opt/rh/devtoolset-7/root/usr/lib/gcc/x86_64-redhat-linux/7/../../../:/lib/:/usr/lib/
COLLECT_GCC_OPTIONS='-v' '-rdynamic' '-o' 'cmTC_10c20' '-mtune=generic' '-march=x86-64'
 /opt/rh/devtoolset-7/root/usr/libexec/gcc/x86_64-redhat-linux/7/collect2 -plugin /opt/rh/devtoolset-7/root/usr/libexec/gcc/x86_64-redhat-linux/7/liblto_plugin.so -plugin-opt=/opt/rh/devtoolset-7/root/usr/libexec/gcc/x86_64-redhat-linux/7/lto-wrapper -plugin-opt=-fresolution=/tmp/cce7mXds.res -plugin-opt=-pass-through=-lgcc -plugin-opt=-pass-through=-lgcc_s -plugin-opt=-pass-through=-lc -plugin-opt=-pass-through=-lgcc -plugin-opt=-pass-through=-lgcc_s --build-id --no-add-needed --eh-frame-hdr --hash-style=gnu -m elf_x86_64 -export-dynamic -dynamic-linker /lib64/ld-linux-x86-64.so.2 -o cmTC_10c20 /lib/../lib64/crt1.o /lib/../lib64/crti.o /opt/rh/devtoolset-7/root/usr/lib/gcc/x86_64-redhat-linux/7/crtbegin.o -L/opt/rh/devtoolset-7/root/usr/lib/gcc/x86_64-redhat-linux/7 -L/opt/rh/devtoolset-7/root/usr/lib/gcc/x86_64-redhat-linux/7/../../../../lib64 -L/lib/../lib64 -L/usr/lib/../lib64 -L/opt/rh/devtoolset-7/root/usr/lib/gcc/x86_64-redhat-linux/7/../../.. CMakeFiles/cmTC_10c20.dir/CMakeCCompilerABI.c.o -lgcc --as-needed -lgcc_s --no-as-needed -lc -lgcc --as-needed -lgcc_s --no-as-needed /opt/rh/devtoolset-7/root/usr/lib/gcc/x86_64-redhat-linux/7/crtend.o /lib/../lib64/crtn.o
COLLECT_GCC_OPTIONS='-v' '-rdynamic' '-o' 'cmTC_10c20' '-mtune=generic' '-march=x86-64'
gmake[1]: Leaving directory '/home/centos/smoketest/PR-14916/build/CMakeFiles/CMakeTmp'


Parsed C implicit link information from above output:
  link line regex: [^( *|.*[/\])(ld|CMAKE_LINK_STARTFILE-NOTFOUND|([^/\]+-)?ld|collect2)[^/\]*( |$)]
  ignore line: [Change Dir: /home/centos/smoketest/PR-14916/build/CMakeFiles/CMakeTmp]
  ignore line: []
  ignore line: [Run Build Command:"/opt/rh/devtoolset-7/root/usr/bin/gmake" "cmTC_10c20/fast"]
  ignore line: [/opt/rh/devtoolset-7/root/usr/bin/gmake -f CMakeFiles/cmTC_10c20.dir/build.make CMakeFiles/cmTC_10c20.dir/build]
  ignore line: [gmake[1]: Entering directory '/home/centos/smoketest/PR-14916/build/CMakeFiles/CMakeTmp']
  ignore line: [Building C object CMakeFiles/cmTC_10c20.dir/CMakeCCompilerABI.c.o]
  ignore line: [/opt/rh/devtoolset-7/root/usr/bin/cc    -o CMakeFiles/cmTC_10c20.dir/CMakeCCompilerABI.c.o   -c /usr/local/share/cmake-3.13/Modules/CMakeCCompilerABI.c]
  ignore line: [Linking C executable cmTC_10c20]
  ignore line: [/usr/local/bin/cmake -E cmake_link_script CMakeFiles/cmTC_10c20.dir/link.txt --verbose=1]
  ignore line: [/opt/rh/devtoolset-7/root/usr/bin/cc     -v -rdynamic CMakeFiles/cmTC_10c20.dir/CMakeCCompilerABI.c.o  -o cmTC_10c20 ]
  ignore line: [Using built-in specs.]
  ignore line: [COLLECT_GCC=/opt/rh/devtoolset-7/root/usr/bin/cc]
  ignore line: [COLLECT_LTO_WRAPPER=/opt/rh/devtoolset-7/root/usr/libexec/gcc/x86_64-redhat-linux/7/lto-wrapper]
  ignore line: [Target: x86_64-redhat-linux]
  ignore line: [Configured with: ../configure --enable-bootstrap --enable-languages=c,c++,fortran,lto --prefix=/opt/rh/devtoolset-7/root/usr --mandir=/opt/rh/devtoolset-7/root/usr/share/man --infodir=/opt/rh/devtoolset-7/root/usr/share/info --with-bugurl=http://bugzilla.redhat.com/bugzilla --enable-shared --enable-threads=posix --enable-checking=release --enable-multilib --with-system-zlib --enable-__cxa_atexit --disable-libunwind-exceptions --enable-gnu-unique-object --enable-linker-build-id --with-gcc-major-version-only --enable-plugin --with-linker-hash-style=gnu --enable-initfini-array --with-default-libstdcxx-abi=gcc4-compatible --with-isl=/builddir/build/BUILD/gcc-7.3.1-20180303/obj-x86_64-redhat-linux/isl-install --enable-libmpx --enable-gnu-indirect-function --with-tune=generic --with-arch_32=i686 --build=x86_64-redhat-linux]
  ignore line: [Thread model: posix]
  ignore line: [gcc version 7.3.1 20180303 (Red Hat 7.3.1-5) (GCC) ]
  ignore line: [COMPILER_PATH=/opt/rh/devtoolset-7/root/usr/libexec/gcc/x86_64-redhat-linux/7/:/opt/rh/devtoolset-7/root/usr/libexec/gcc/x86_64-redhat-linux/7/:/opt/rh/devtoolset-7/root/usr/libexec/gcc/x86_64-redhat-linux/:/opt/rh/devtoolset-7/root/usr/lib/gcc/x86_64-redhat-linux/7/:/opt/rh/devtoolset-7/root/usr/lib/gcc/x86_64-redhat-linux/]
  ignore line: [LIBRARY_PATH=/opt/rh/devtoolset-7/root/usr/lib/gcc/x86_64-redhat-linux/7/:/opt/rh/devtoolset-7/root/usr/lib/gcc/x86_64-redhat-linux/7/../../../../lib64/:/lib/../lib64/:/usr/lib/../lib64/:/opt/rh/devtoolset-7/root/usr/lib/gcc/x86_64-redhat-linux/7/../../../:/lib/:/usr/lib/]
  ignore line: [COLLECT_GCC_OPTIONS='-v' '-rdynamic' '-o' 'cmTC_10c20' '-mtune=generic' '-march=x86-64']
  link line: [ /opt/rh/devtoolset-7/root/usr/libexec/gcc/x86_64-redhat-linux/7/collect2 -plugin /opt/rh/devtoolset-7/root/usr/libexec/gcc/x86_64-redhat-linux/7/liblto_plugin.so -plugin-opt=/opt/rh/devtoolset-7/root/usr/libexec/gcc/x86_64-redhat-linux/7/lto-wrapper -plugin-opt=-fresolution=/tmp/cce7mXds.res -plugin-opt=-pass-through=-lgcc -plugin-opt=-pass-through=-lgcc_s -plugin-opt=-pass-through=-lc -plugin-opt=-pass-through=-lgcc -plugin-opt=-pass-through=-lgcc_s --build-id --no-add-needed --eh-frame-hdr --hash-style=gnu -m elf_x86_64 -export-dynamic -dynamic-linker /lib64/ld-linux-x86-64.so.2 -o cmTC_10c20 /lib/../lib64/crt1.o /lib/../lib64/crti.o /opt/rh/devtoolset-7/root/usr/lib/gcc/x86_64-redhat-linux/7/crtbegin.o -L/opt/rh/devtoolset-7/root/usr/lib/gcc/x86_64-redhat-linux/7 -L/opt/rh/devtoolset-7/root/usr/lib/gcc/x86_64-redhat-linux/7/../../../../lib64 -L/lib/../lib64 -L/usr/lib/../lib64 -L/opt/rh/devtoolset-7/root/usr/lib/gcc/x86_64-redhat-linux/7/../../.. CMakeFiles/cmTC_10c20.dir/CMakeCCompilerABI.c.o -lgcc --as-needed -lgcc_s --no-as-needed -lc -lgcc --as-needed -lgcc_s --no-as-needed /opt/rh/devtoolset-7/root/usr/lib/gcc/x86_64-redhat-linux/7/crtend.o /lib/../lib64/crtn.o]
    arg [/opt/rh/devtoolset-7/root/usr/libexec/gcc/x86_64-redhat-linux/7/collect2] ==> ignore
    arg [-plugin] ==> ignore
    arg [/opt/rh/devtoolset-7/root/usr/libexec/gcc/x86_64-redhat-linux/7/liblto_plugin.so] ==> ignore
    arg [-plugin-opt=/opt/rh/devtoolset-7/root/usr/libexec/gcc/x86_64-redhat-linux/7/lto-wrapper] ==> ignore
    arg [-plugin-opt=-fresolution=/tmp/cce7mXds.res] ==> ignore
    arg [-plugin-opt=-pass-through=-lgcc] ==> ignore
    arg [-plugin-opt=-pass-through=-lgcc_s] ==> ignore
    arg [-plugin-opt=-pass-through=-lc] ==> ignore
    arg [-plugin-opt=-pass-through=-lgcc] ==> ignore
    arg [-plugin-opt=-pass-through=-lgcc_s] ==> ignore
    arg [--build-id] ==> ignore
    arg [--no-add-needed] ==> ignore
    arg [--eh-frame-hdr] ==> ignore
    arg [--hash-style=gnu] ==> ignore
    arg [-m] ==> ignore
    arg [elf_x86_64] ==> ignore
    arg [-export-dynamic] ==> ignore
    arg [-dynamic-linker] ==> ignore
    arg [/lib64/ld-linux-x86-64.so.2] ==> ignore
    arg [-o] ==> ignore
    arg [cmTC_10c20] ==> ignore
    arg [/lib/../lib64/crt1.o] ==> ignore
    arg [/lib/../lib64/crti.o] ==> ignore
    arg [/opt/rh/devtoolset-7/root/usr/lib/gcc/x86_64-redhat-linux/7/crtbegin.o] ==> ignore
    arg [-L/opt/rh/devtoolset-7/root/usr/lib/gcc/x86_64-redhat-linux/7] ==> dir [/opt/rh/devtoolset-7/root/usr/lib/gcc/x86_64-redhat-linux/7]
    arg [-L/opt/rh/devtoolset-7/root/usr/lib/gcc/x86_64-redhat-linux/7/../../../../lib64] ==> dir [/opt/rh/devtoolset-7/root/usr/lib/gcc/x86_64-redhat-linux/7/../../../../lib64]
    arg [-L/lib/../lib64] ==> dir [/lib/../lib64]
    arg [-L/usr/lib/../lib64] ==> dir [/usr/lib/../lib64]
    arg [-L/opt/rh/devtoolset-7/root/usr/lib/gcc/x86_64-redhat-linux/7/../../..] ==> dir [/opt/rh/devtoolset-7/root/usr/lib/gcc/x86_64-redhat-linux/7/../../..]
    arg [CMakeFiles/cmTC_10c20.dir/CMakeCCompilerABI.c.o] ==> ignore
    arg [-lgcc] ==> lib [gcc]
    arg [--as-needed] ==> ignore
    arg [-lgcc_s] ==> lib [gcc_s]
    arg [--no-as-needed] ==> ignore
    arg [-lc] ==> lib [c]
    arg [-lgcc] ==> lib [gcc]
    arg [--as-needed] ==> ignore
    arg [-lgcc_s] ==> lib [gcc_s]
    arg [--no-as-needed] ==> ignore
    arg [/opt/rh/devtoolset-7/root/usr/lib/gcc/x86_64-redhat-linux/7/crtend.o] ==> ignore
    arg [/lib/../lib64/crtn.o] ==> ignore
  collapse library dir [/opt/rh/devtoolset-7/root/usr/lib/gcc/x86_64-redhat-linux/7] ==> [/opt/rh/devtoolset-7/root/usr/lib/gcc/x86_64-redhat-linux/7]
  collapse library dir [/opt/rh/devtoolset-7/root/usr/lib/gcc/x86_64-redhat-linux/7/../../../../lib64] ==> [/opt/rh/devtoolset-7/root/usr/lib64]
  collapse library dir [/lib/../lib64] ==> [/lib64]
  collapse library dir [/usr/lib/../lib64] ==> [/usr/lib64]
  collapse library dir [/opt/rh/devtoolset-7/root/usr/lib/gcc/x86_64-redhat-linux/7/../../..] ==> [/opt/rh/devtoolset-7/root/usr/lib]
  implicit libs: [gcc;gcc_s;c;gcc;gcc_s]
  implicit dirs: [/opt/rh/devtoolset-7/root/usr/lib/gcc/x86_64-redhat-linux/7;/opt/rh/devtoolset-7/root/usr/lib64;/lib64;/usr/lib64;/opt/rh/devtoolset-7/root/usr/lib]
  implicit fwks: []




Detecting C [-std=c11] compiler features compiled with the following output:
Change Dir: /home/centos/smoketest/PR-14916/build/CMakeFiles/CMakeTmp

Run Build Command:"/opt/rh/devtoolset-7/root/usr/bin/gmake" "cmTC_89916/fast"
/opt/rh/devtoolset-7/root/usr/bin/gmake -f CMakeFiles/cmTC_89916.dir/build.make CMakeFiles/cmTC_89916.dir/build
gmake[1]: Entering directory '/home/centos/smoketest/PR-14916/build/CMakeFiles/CMakeTmp'
Building C object CMakeFiles/cmTC_89916.dir/feature_tests.c.o
/opt/rh/devtoolset-7/root/usr/bin/cc   -std=c11 -o CMakeFiles/cmTC_89916.dir/feature_tests.c.o   -c /home/centos/smoketest/PR-14916/build/CMakeFiles/feature_tests.c
Linking C executable cmTC_89916
/usr/local/bin/cmake -E cmake_link_script CMakeFiles/cmTC_89916.dir/link.txt --verbose=1
/opt/rh/devtoolset-7/root/usr/bin/cc      -rdynamic CMakeFiles/cmTC_89916.dir/feature_tests.c.o  -o cmTC_89916 
gmake[1]: Leaving directory '/home/centos/smoketest/PR-14916/build/CMakeFiles/CMakeTmp'


    Feature record: C_FEATURE:1c_function_prototypes
    Feature record: C_FEATURE:1c_restrict
    Feature record: C_FEATURE:1c_static_assert
    Feature record: C_FEATURE:1c_variadic_macros


Detecting C [-std=c99] compiler features compiled with the following output:
Change Dir: /home/centos/smoketest/PR-14916/build/CMakeFiles/CMakeTmp

Run Build Command:"/opt/rh/devtoolset-7/root/usr/bin/gmake" "cmTC_8c2f6/fast"
/opt/rh/devtoolset-7/root/usr/bin/gmake -f CMakeFiles/cmTC_8c2f6.dir/build.make CMakeFiles/cmTC_8c2f6.dir/build
gmake[1]: Entering directory '/home/centos/smoketest/PR-14916/build/CMakeFiles/CMakeTmp'
Building C object CMakeFiles/cmTC_8c2f6.dir/feature_tests.c.o
/opt/rh/devtoolset-7/root/usr/bin/cc   -std=c99 -o CMakeFiles/cmTC_8c2f6.dir/feature_tests.c.o   -c /home/centos/smoketest/PR-14916/build/CMakeFiles/feature_tests.c
Linking C executable cmTC_8c2f6
/usr/local/bin/cmake -E cmake_link_script CMakeFiles/cmTC_8c2f6.dir/link.txt --verbose=1
/opt/rh/devtoolset-7/root/usr/bin/cc      -rdynamic CMakeFiles/cmTC_8c2f6.dir/feature_tests.c.o  -o cmTC_8c2f6 
gmake[1]: Leaving directory '/home/centos/smoketest/PR-14916/build/CMakeFiles/CMakeTmp'


    Feature record: C_FEATURE:1c_function_prototypes
    Feature record: C_FEATURE:1c_restrict
    Feature record: C_FEATURE:0c_static_assert
    Feature record: C_FEATURE:1c_variadic_macros


Detecting C [-std=c90] compiler features compiled with the following output:
Change Dir: /home/centos/smoketest/PR-14916/build/CMakeFiles/CMakeTmp

Run Build Command:"/opt/rh/devtoolset-7/root/usr/bin/gmake" "cmTC_d0663/fast"
/opt/rh/devtoolset-7/root/usr/bin/gmake -f CMakeFiles/cmTC_d0663.dir/build.make CMakeFiles/cmTC_d0663.dir/build
gmake[1]: Entering directory '/home/centos/smoketest/PR-14916/build/CMakeFiles/CMakeTmp'
Building C object CMakeFiles/cmTC_d0663.dir/feature_tests.c.o
/opt/rh/devtoolset-7/root/usr/bin/cc   -std=c90 -o CMakeFiles/cmTC_d0663.dir/feature_tests.c.o   -c /home/centos/smoketest/PR-14916/build/CMakeFiles/feature_tests.c
Linking C executable cmTC_d0663
/usr/local/bin/cmake -E cmake_link_script CMakeFiles/cmTC_d0663.dir/link.txt --verbose=1
/opt/rh/devtoolset-7/root/usr/bin/cc      -rdynamic CMakeFiles/cmTC_d0663.dir/feature_tests.c.o  -o cmTC_d0663 
gmake[1]: Leaving directory '/home/centos/smoketest/PR-14916/build/CMakeFiles/CMakeTmp'


    Feature record: C_FEATURE:1c_function_prototypes
    Feature record: C_FEATURE:0c_restrict
    Feature record: C_FEATURE:0c_static_assert
    Feature record: C_FEATURE:0c_variadic_macros
Determining if the CXX compiler works passed with the following output:
Change Dir: /home/centos/smoketest/PR-14916/build/CMakeFiles/CMakeTmp

Run Build Command:"/opt/rh/devtoolset-7/root/usr/bin/gmake" "cmTC_4d416/fast"
/opt/rh/devtoolset-7/root/usr/bin/gmake -f CMakeFiles/cmTC_4d416.dir/build.make CMakeFiles/cmTC_4d416.dir/build
gmake[1]: Entering directory '/home/centos/smoketest/PR-14916/build/CMakeFiles/CMakeTmp'
Building CXX object CMakeFiles/cmTC_4d416.dir/testCXXCompiler.cxx.o
/opt/rh/devtoolset-7/root/usr/bin/c++     -o CMakeFiles/cmTC_4d416.dir/testCXXCompiler.cxx.o -c /home/centos/smoketest/PR-14916/build/CMakeFiles/CMakeTmp/testCXXCompiler.cxx
Linking CXX executable cmTC_4d416
/usr/local/bin/cmake -E cmake_link_script CMakeFiles/cmTC_4d416.dir/link.txt --verbose=1
/opt/rh/devtoolset-7/root/usr/bin/c++       -rdynamic CMakeFiles/cmTC_4d416.dir/testCXXCompiler.cxx.o  -o cmTC_4d416 
gmake[1]: Leaving directory '/home/centos/smoketest/PR-14916/build/CMakeFiles/CMakeTmp'


Detecting CXX compiler ABI info compiled with the following output:
Change Dir: /home/centos/smoketest/PR-14916/build/CMakeFiles/CMakeTmp

Run Build Command:"/opt/rh/devtoolset-7/root/usr/bin/gmake" "cmTC_50d85/fast"
/opt/rh/devtoolset-7/root/usr/bin/gmake -f CMakeFiles/cmTC_50d85.dir/build.make CMakeFiles/cmTC_50d85.dir/build
gmake[1]: Entering directory '/home/centos/smoketest/PR-14916/build/CMakeFiles/CMakeTmp'
Building CXX object CMakeFiles/cmTC_50d85.dir/CMakeCXXCompilerABI.cpp.o
/opt/rh/devtoolset-7/root/usr/bin/c++     -o CMakeFiles/cmTC_50d85.dir/CMakeCXXCompilerABI.cpp.o -c /usr/local/share/cmake-3.13/Modules/CMakeCXXCompilerABI.cpp
Linking CXX executable cmTC_50d85
/usr/local/bin/cmake -E cmake_link_script CMakeFiles/cmTC_50d85.dir/link.txt --verbose=1
/opt/rh/devtoolset-7/root/usr/bin/c++      -v -rdynamic CMakeFiles/cmTC_50d85.dir/CMakeCXXCompilerABI.cpp.o  -o cmTC_50d85 
Using built-in specs.
COLLECT_GCC=/opt/rh/devtoolset-7/root/usr/bin/c++
COLLECT_LTO_WRAPPER=/opt/rh/devtoolset-7/root/usr/libexec/gcc/x86_64-redhat-linux/7/lto-wrapper
Target: x86_64-redhat-linux
Configured with: ../configure --enable-bootstrap --enable-languages=c,c++,fortran,lto --prefix=/opt/rh/devtoolset-7/root/usr --mandir=/opt/rh/devtoolset-7/root/usr/share/man --infodir=/opt/rh/devtoolset-7/root/usr/share/info --with-bugurl=http://bugzilla.redhat.com/bugzilla --enable-shared --enable-threads=posix --enable-checking=release --enable-multilib --with-system-zlib --enable-__cxa_atexit --disable-libunwind-exceptions --enable-gnu-unique-object --enable-linker-build-id --with-gcc-major-version-only --enable-plugin --with-linker-hash-style=gnu --enable-initfini-array --with-default-libstdcxx-abi=gcc4-compatible --with-isl=/builddir/build/BUILD/gcc-7.3.1-20180303/obj-x86_64-redhat-linux/isl-install --enable-libmpx --enable-gnu-indirect-function --with-tune=generic --with-arch_32=i686 --build=x86_64-redhat-linux
Thread model: posix
gcc version 7.3.1 20180303 (Red Hat 7.3.1-5) (GCC) 
COMPILER_PATH=/opt/rh/devtoolset-7/root/usr/libexec/gcc/x86_64-redhat-linux/7/:/opt/rh/devtoolset-7/root/usr/libexec/gcc/x86_64-redhat-linux/7/:/opt/rh/devtoolset-7/root/usr/libexec/gcc/x86_64-redhat-linux/:/opt/rh/devtoolset-7/root/usr/lib/gcc/x86_64-redhat-linux/7/:/opt/rh/devtoolset-7/root/usr/lib/gcc/x86_64-redhat-linux/
LIBRARY_PATH=/opt/rh/devtoolset-7/root/usr/lib/gcc/x86_64-redhat-linux/7/:/opt/rh/devtoolset-7/root/usr/lib/gcc/x86_64-redhat-linux/7/../../../../lib64/:/lib/../lib64/:/usr/lib/../lib64/:/opt/rh/devtoolset-7/root/usr/lib/gcc/x86_64-redhat-linux/7/../../../:/lib/:/usr/lib/
COLLECT_GCC_OPTIONS='-v' '-rdynamic' '-o' 'cmTC_50d85' '-shared-libgcc' '-mtune=generic' '-march=x86-64'
 /opt/rh/devtoolset-7/root/usr/libexec/gcc/x86_64-redhat-linux/7/collect2 -plugin /opt/rh/devtoolset-7/root/usr/libexec/gcc/x86_64-redhat-linux/7/liblto_plugin.so -plugin-opt=/opt/rh/devtoolset-7/root/usr/libexec/gcc/x86_64-redhat-linux/7/lto-wrapper -plugin-opt=-fresolution=/tmp/ccSWOI9C.res -plugin-opt=-pass-through=-lgcc_s -plugin-opt=-pass-through=-lgcc -plugin-opt=-pass-through=-lc -plugin-opt=-pass-through=-lgcc_s -plugin-opt=-pass-through=-lgcc --build-id --no-add-needed --eh-frame-hdr --hash-style=gnu -m elf_x86_64 -export-dynamic -dynamic-linker /lib64/ld-linux-x86-64.so.2 -o cmTC_50d85 /lib/../lib64/crt1.o /lib/../lib64/crti.o /opt/rh/devtoolset-7/root/usr/lib/gcc/x86_64-redhat-linux/7/crtbegin.o -L/opt/rh/devtoolset-7/root/usr/lib/gcc/x86_64-redhat-linux/7 -L/opt/rh/devtoolset-7/root/usr/lib/gcc/x86_64-redhat-linux/7/../../../../lib64 -L/lib/../lib64 -L/usr/lib/../lib64 -L/opt/rh/devtoolset-7/root/usr/lib/gcc/x86_64-redhat-linux/7/../../.. CMakeFiles/cmTC_50d85.dir/CMakeCXXCompilerABI.cpp.o -lstdc++ -lm -lgcc_s -lgcc -lc -lgcc_s -lgcc /opt/rh/devtoolset-7/root/usr/lib/gcc/x86_64-redhat-linux/7/crtend.o /lib/../lib64/crtn.o
COLLECT_GCC_OPTIONS='-v' '-rdynamic' '-o' 'cmTC_50d85' '-shared-libgcc' '-mtune=generic' '-march=x86-64'
gmake[1]: Leaving directory '/home/centos/smoketest/PR-14916/build/CMakeFiles/CMakeTmp'


Parsed CXX implicit link information from above output:
  link line regex: [^( *|.*[/\])(ld|CMAKE_LINK_STARTFILE-NOTFOUND|([^/\]+-)?ld|collect2)[^/\]*( |$)]
  ignore line: [Change Dir: /home/centos/smoketest/PR-14916/build/CMakeFiles/CMakeTmp]
  ignore line: []
  ignore line: [Run Build Command:"/opt/rh/devtoolset-7/root/usr/bin/gmake" "cmTC_50d85/fast"]
  ignore line: [/opt/rh/devtoolset-7/root/usr/bin/gmake -f CMakeFiles/cmTC_50d85.dir/build.make CMakeFiles/cmTC_50d85.dir/build]
  ignore line: [gmake[1]: Entering directory '/home/centos/smoketest/PR-14916/build/CMakeFiles/CMakeTmp']
  ignore line: [Building CXX object CMakeFiles/cmTC_50d85.dir/CMakeCXXCompilerABI.cpp.o]
  ignore line: [/opt/rh/devtoolset-7/root/usr/bin/c++     -o CMakeFiles/cmTC_50d85.dir/CMakeCXXCompilerABI.cpp.o -c /usr/local/share/cmake-3.13/Modules/CMakeCXXCompilerABI.cpp]
  ignore line: [Linking CXX executable cmTC_50d85]
  ignore line: [/usr/local/bin/cmake -E cmake_link_script CMakeFiles/cmTC_50d85.dir/link.txt --verbose=1]
  ignore line: [/opt/rh/devtoolset-7/root/usr/bin/c++      -v -rdynamic CMakeFiles/cmTC_50d85.dir/CMakeCXXCompilerABI.cpp.o  -o cmTC_50d85 ]
  ignore line: [Using built-in specs.]
  ignore line: [COLLECT_GCC=/opt/rh/devtoolset-7/root/usr/bin/c++]
  ignore line: [COLLECT_LTO_WRAPPER=/opt/rh/devtoolset-7/root/usr/libexec/gcc/x86_64-redhat-linux/7/lto-wrapper]
  ignore line: [Target: x86_64-redhat-linux]
  ignore line: [Configured with: ../configure --enable-bootstrap --enable-languages=c,c++,fortran,lto --prefix=/opt/rh/devtoolset-7/root/usr --mandir=/opt/rh/devtoolset-7/root/usr/share/man --infodir=/opt/rh/devtoolset-7/root/usr/share/info --with-bugurl=http://bugzilla.redhat.com/bugzilla --enable-shared --enable-threads=posix --enable-checking=release --enable-multilib --with-system-zlib --enable-__cxa_atexit --disable-libunwind-exceptions --enable-gnu-unique-object --enable-linker-build-id --with-gcc-major-version-only --enable-plugin --with-linker-hash-style=gnu --enable-initfini-array --with-default-libstdcxx-abi=gcc4-compatible --with-isl=/builddir/build/BUILD/gcc-7.3.1-20180303/obj-x86_64-redhat-linux/isl-install --enable-libmpx --enable-gnu-indirect-function --with-tune=generic --with-arch_32=i686 --build=x86_64-redhat-linux]
  ignore line: [Thread model: posix]
  ignore line: [gcc version 7.3.1 20180303 (Red Hat 7.3.1-5) (GCC) ]
  ignore line: [COMPILER_PATH=/opt/rh/devtoolset-7/root/usr/libexec/gcc/x86_64-redhat-linux/7/:/opt/rh/devtoolset-7/root/usr/libexec/gcc/x86_64-redhat-linux/7/:/opt/rh/devtoolset-7/root/usr/libexec/gcc/x86_64-redhat-linux/:/opt/rh/devtoolset-7/root/usr/lib/gcc/x86_64-redhat-linux/7/:/opt/rh/devtoolset-7/root/usr/lib/gcc/x86_64-redhat-linux/]
  ignore line: [LIBRARY_PATH=/opt/rh/devtoolset-7/root/usr/lib/gcc/x86_64-redhat-linux/7/:/opt/rh/devtoolset-7/root/usr/lib/gcc/x86_64-redhat-linux/7/../../../../lib64/:/lib/../lib64/:/usr/lib/../lib64/:/opt/rh/devtoolset-7/root/usr/lib/gcc/x86_64-redhat-linux/7/../../../:/lib/:/usr/lib/]
  ignore line: [COLLECT_GCC_OPTIONS='-v' '-rdynamic' '-o' 'cmTC_50d85' '-shared-libgcc' '-mtune=generic' '-march=x86-64']
  link line: [ /opt/rh/devtoolset-7/root/usr/libexec/gcc/x86_64-redhat-linux/7/collect2 -plugin /opt/rh/devtoolset-7/root/usr/libexec/gcc/x86_64-redhat-linux/7/liblto_plugin.so -plugin-opt=/opt/rh/devtoolset-7/root/usr/libexec/gcc/x86_64-redhat-linux/7/lto-wrapper -plugin-opt=-fresolution=/tmp/ccSWOI9C.res -plugin-opt=-pass-through=-lgcc_s -plugin-opt=-pass-through=-lgcc -plugin-opt=-pass-through=-lc -plugin-opt=-pass-through=-lgcc_s -plugin-opt=-pass-through=-lgcc --build-id --no-add-needed --eh-frame-hdr --hash-style=gnu -m elf_x86_64 -export-dynamic -dynamic-linker /lib64/ld-linux-x86-64.so.2 -o cmTC_50d85 /lib/../lib64/crt1.o /lib/../lib64/crti.o /opt/rh/devtoolset-7/root/usr/lib/gcc/x86_64-redhat-linux/7/crtbegin.o -L/opt/rh/devtoolset-7/root/usr/lib/gcc/x86_64-redhat-linux/7 -L/opt/rh/devtoolset-7/root/usr/lib/gcc/x86_64-redhat-linux/7/../../../../lib64 -L/lib/../lib64 -L/usr/lib/../lib64 -L/opt/rh/devtoolset-7/root/usr/lib/gcc/x86_64-redhat-linux/7/../../.. CMakeFiles/cmTC_50d85.dir/CMakeCXXCompilerABI.cpp.o -lstdc++ -lm -lgcc_s -lgcc -lc -lgcc_s -lgcc /opt/rh/devtoolset-7/root/usr/lib/gcc/x86_64-redhat-linux/7/crtend.o /lib/../lib64/crtn.o]
    arg [/opt/rh/devtoolset-7/root/usr/libexec/gcc/x86_64-redhat-linux/7/collect2] ==> ignore
    arg [-plugin] ==> ignore
    arg [/opt/rh/devtoolset-7/root/usr/libexec/gcc/x86_64-redhat-linux/7/liblto_plugin.so] ==> ignore
    arg [-plugin-opt=/opt/rh/devtoolset-7/root/usr/libexec/gcc/x86_64-redhat-linux/7/lto-wrapper] ==> ignore
    arg [-plugin-opt=-fresolution=/tmp/ccSWOI9C.res] ==> ignore
    arg [-plugin-opt=-pass-through=-lgcc_s] ==> ignore
    arg [-plugin-opt=-pass-through=-lgcc] ==> ignore
    arg [-plugin-opt=-pass-through=-lc] ==> ignore
    arg [-plugin-opt=-pass-through=-lgcc_s] ==> ignore
    arg [-plugin-opt=-pass-through=-lgcc] ==> ignore
    arg [--build-id] ==> ignore
    arg [--no-add-needed] ==> ignore
    arg [--eh-frame-hdr] ==> ignore
    arg [--hash-style=gnu] ==> ignore
    arg [-m] ==> ignore
    arg [elf_x86_64] ==> ignore
    arg [-export-dynamic] ==> ignore
    arg [-dynamic-linker] ==> ignore
    arg [/lib64/ld-linux-x86-64.so.2] ==> ignore
    arg [-o] ==> ignore
    arg [cmTC_50d85] ==> ignore
    arg [/lib/../lib64/crt1.o] ==> ignore
    arg [/lib/../lib64/crti.o] ==> ignore
    arg [/opt/rh/devtoolset-7/root/usr/lib/gcc/x86_64-redhat-linux/7/crtbegin.o] ==> ignore
    arg [-L/opt/rh/devtoolset-7/root/usr/lib/gcc/x86_64-redhat-linux/7] ==> dir [/opt/rh/devtoolset-7/root/usr/lib/gcc/x86_64-redhat-linux/7]
    arg [-L/opt/rh/devtoolset-7/root/usr/lib/gcc/x86_64-redhat-linux/7/../../../../lib64] ==> dir [/opt/rh/devtoolset-7/root/usr/lib/gcc/x86_64-redhat-linux/7/../../../../lib64]
    arg [-L/lib/../lib64] ==> dir [/lib/../lib64]
    arg [-L/usr/lib/../lib64] ==> dir [/usr/lib/../lib64]
    arg [-L/opt/rh/devtoolset-7/root/usr/lib/gcc/x86_64-redhat-linux/7/../../..] ==> dir [/opt/rh/devtoolset-7/root/usr/lib/gcc/x86_64-redhat-linux/7/../../..]
    arg [CMakeFiles/cmTC_50d85.dir/CMakeCXXCompilerABI.cpp.o] ==> ignore
    arg [-lstdc++] ==> lib [stdc++]
    arg [-lm] ==> lib [m]
    arg [-lgcc_s] ==> lib [gcc_s]
    arg [-lgcc] ==> lib [gcc]
    arg [-lc] ==> lib [c]
    arg [-lgcc_s] ==> lib [gcc_s]
    arg [-lgcc] ==> lib [gcc]
    arg [/opt/rh/devtoolset-7/root/usr/lib/gcc/x86_64-redhat-linux/7/crtend.o] ==> ignore
    arg [/lib/../lib64/crtn.o] ==> ignore
  collapse library dir [/opt/rh/devtoolset-7/root/usr/lib/gcc/x86_64-redhat-linux/7] ==> [/opt/rh/devtoolset-7/root/usr/lib/gcc/x86_64-redhat-linux/7]
  collapse library dir [/opt/rh/devtoolset-7/root/usr/lib/gcc/x86_64-redhat-linux/7/../../../../lib64] ==> [/opt/rh/devtoolset-7/root/usr/lib64]
  collapse library dir [/lib/../lib64] ==> [/lib64]
  collapse library dir [/usr/lib/../lib64] ==> [/usr/lib64]
  collapse library dir [/opt/rh/devtoolset-7/root/usr/lib/gcc/x86_64-redhat-linux/7/../../..] ==> [/opt/rh/devtoolset-7/root/usr/lib]
  implicit libs: [stdc++;m;gcc_s;gcc;c;gcc_s;gcc]
  implicit dirs: [/opt/rh/devtoolset-7/root/usr/lib/gcc/x86_64-redhat-linux/7;/opt/rh/devtoolset-7/root/usr/lib64;/lib64;/usr/lib64;/opt/rh/devtoolset-7/root/usr/lib]
  implicit fwks: []




Detecting CXX [-std=c++1z] compiler features compiled with the following output:
Change Dir: /home/centos/smoketest/PR-14916/build/CMakeFiles/CMakeTmp

Run Build Command:"/opt/rh/devtoolset-7/root/usr/bin/gmake" "cmTC_2382d/fast"
/opt/rh/devtoolset-7/root/usr/bin/gmake -f CMakeFiles/cmTC_2382d.dir/build.make CMakeFiles/cmTC_2382d.dir/build
gmake[1]: Entering directory '/home/centos/smoketest/PR-14916/build/CMakeFiles/CMakeTmp'
Building CXX object CMakeFiles/cmTC_2382d.dir/feature_tests.cxx.o
/opt/rh/devtoolset-7/root/usr/bin/c++    -std=c++1z -o CMakeFiles/cmTC_2382d.dir/feature_tests.cxx.o -c /home/centos/smoketest/PR-14916/build/CMakeFiles/feature_tests.cxx
Linking CXX executable cmTC_2382d
/usr/local/bin/cmake -E cmake_link_script CMakeFiles/cmTC_2382d.dir/link.txt --verbose=1
/opt/rh/devtoolset-7/root/usr/bin/c++       -rdynamic CMakeFiles/cmTC_2382d.dir/feature_tests.cxx.o  -o cmTC_2382d 
gmake[1]: Leaving directory '/home/centos/smoketest/PR-14916/build/CMakeFiles/CMakeTmp'


    Feature record: CXX_FEATURE:1cxx_aggregate_default_initializers
    Feature record: CXX_FEATURE:1cxx_alias_templates
    Feature record: CXX_FEATURE:1cxx_alignas
    Feature record: CXX_FEATURE:1cxx_alignof
    Feature record: CXX_FEATURE:1cxx_attributes
    Feature record: CXX_FEATURE:1cxx_attribute_deprecated
    Feature record: CXX_FEATURE:1cxx_auto_type
    Feature record: CXX_FEATURE:1cxx_binary_literals
    Feature record: CXX_FEATURE:1cxx_constexpr
    Feature record: CXX_FEATURE:1cxx_contextual_conversions
    Feature record: CXX_FEATURE:1cxx_decltype
    Feature record: CXX_FEATURE:1cxx_decltype_auto
    Feature record: CXX_FEATURE:1cxx_decltype_incomplete_return_types
    Feature record: CXX_FEATURE:1cxx_default_function_template_args
    Feature record: CXX_FEATURE:1cxx_defaulted_functions
    Feature record: CXX_FEATURE:1cxx_defaulted_move_initializers
    Feature record: CXX_FEATURE:1cxx_delegating_constructors
    Feature record: CXX_FEATURE:1cxx_deleted_functions
    Feature record: CXX_FEATURE:1cxx_digit_separators
    Feature record: CXX_FEATURE:1cxx_enum_forward_declarations
    Feature record: CXX_FEATURE:1cxx_explicit_conversions
    Feature record: CXX_FEATURE:1cxx_extended_friend_declarations
    Feature record: CXX_FEATURE:1cxx_extern_templates
    Feature record: CXX_FEATURE:1cxx_final
    Feature record: CXX_FEATURE:1cxx_func_identifier
    Feature record: CXX_FEATURE:1cxx_generalized_initializers
    Feature record: CXX_FEATURE:1cxx_generic_lambdas
    Feature record: CXX_FEATURE:1cxx_inheriting_constructors
    Feature record: CXX_FEATURE:1cxx_inline_namespaces
    Feature record: CXX_FEATURE:1cxx_lambdas
    Feature record: CXX_FEATURE:1cxx_lambda_init_captures
    Feature record: CXX_FEATURE:1cxx_local_type_template_args
    Feature record: CXX_FEATURE:1cxx_long_long_type
    Feature record: CXX_FEATURE:1cxx_noexcept
    Feature record: CXX_FEATURE:1cxx_nonstatic_member_init
    Feature record: CXX_FEATURE:1cxx_nullptr
    Feature record: CXX_FEATURE:1cxx_override
    Feature record: CXX_FEATURE:1cxx_range_for
    Feature record: CXX_FEATURE:1cxx_raw_string_literals
    Feature record: CXX_FEATURE:1cxx_reference_qualified_functions
    Feature record: CXX_FEATURE:1cxx_relaxed_constexpr
    Feature record: CXX_FEATURE:1cxx_return_type_deduction
    Feature record: CXX_FEATURE:1cxx_right_angle_brackets
    Feature record: CXX_FEATURE:1cxx_rvalue_references
    Feature record: CXX_FEATURE:1cxx_sizeof_member
    Feature record: CXX_FEATURE:1cxx_static_assert
    Feature record: CXX_FEATURE:1cxx_strong_enums
    Feature record: CXX_FEATURE:1cxx_template_template_parameters
    Feature record: CXX_FEATURE:1cxx_thread_local
    Feature record: CXX_FEATURE:1cxx_trailing_return_types
    Feature record: CXX_FEATURE:1cxx_unicode_literals
    Feature record: CXX_FEATURE:1cxx_uniform_initialization
    Feature record: CXX_FEATURE:1cxx_unrestricted_unions
    Feature record: CXX_FEATURE:1cxx_user_literals
    Feature record: CXX_FEATURE:1cxx_variable_templates
    Feature record: CXX_FEATURE:1cxx_variadic_macros
    Feature record: CXX_FEATURE:1cxx_variadic_templates


Detecting CXX [-std=c++14] compiler features compiled with the following output:
Change Dir: /home/centos/smoketest/PR-14916/build/CMakeFiles/CMakeTmp

Run Build Command:"/opt/rh/devtoolset-7/root/usr/bin/gmake" "cmTC_22a9f/fast"
/opt/rh/devtoolset-7/root/usr/bin/gmake -f CMakeFiles/cmTC_22a9f.dir/build.make CMakeFiles/cmTC_22a9f.dir/build
gmake[1]: Entering directory '/home/centos/smoketest/PR-14916/build/CMakeFiles/CMakeTmp'
Building CXX object CMakeFiles/cmTC_22a9f.dir/feature_tests.cxx.o
/opt/rh/devtoolset-7/root/usr/bin/c++    -std=c++14 -o CMakeFiles/cmTC_22a9f.dir/feature_tests.cxx.o -c /home/centos/smoketest/PR-14916/build/CMakeFiles/feature_tests.cxx
Linking CXX executable cmTC_22a9f
/usr/local/bin/cmake -E cmake_link_script CMakeFiles/cmTC_22a9f.dir/link.txt --verbose=1
/opt/rh/devtoolset-7/root/usr/bin/c++       -rdynamic CMakeFiles/cmTC_22a9f.dir/feature_tests.cxx.o  -o cmTC_22a9f 
gmake[1]: Leaving directory '/home/centos/smoketest/PR-14916/build/CMakeFiles/CMakeTmp'


    Feature record: CXX_FEATURE:1cxx_aggregate_default_initializers
    Feature record: CXX_FEATURE:1cxx_alias_templates
    Feature record: CXX_FEATURE:1cxx_alignas
    Feature record: CXX_FEATURE:1cxx_alignof
    Feature record: CXX_FEATURE:1cxx_attributes
    Feature record: CXX_FEATURE:1cxx_attribute_deprecated
    Feature record: CXX_FEATURE:1cxx_auto_type
    Feature record: CXX_FEATURE:1cxx_binary_literals
    Feature record: CXX_FEATURE:1cxx_constexpr
    Feature record: CXX_FEATURE:1cxx_contextual_conversions
    Feature record: CXX_FEATURE:1cxx_decltype
    Feature record: CXX_FEATURE:1cxx_decltype_auto
    Feature record: CXX_FEATURE:1cxx_decltype_incomplete_return_types
    Feature record: CXX_FEATURE:1cxx_default_function_template_args
    Feature record: CXX_FEATURE:1cxx_defaulted_functions
    Feature record: CXX_FEATURE:1cxx_defaulted_move_initializers
    Feature record: CXX_FEATURE:1cxx_delegating_constructors
    Feature record: CXX_FEATURE:1cxx_deleted_functions
    Feature record: CXX_FEATURE:1cxx_digit_separators
    Feature record: CXX_FEATURE:1cxx_enum_forward_declarations
    Feature record: CXX_FEATURE:1cxx_explicit_conversions
    Feature record: CXX_FEATURE:1cxx_extended_friend_declarations
    Feature record: CXX_FEATURE:1cxx_extern_templates
    Feature record: CXX_FEATURE:1cxx_final
    Feature record: CXX_FEATURE:1cxx_func_identifier
    Feature record: CXX_FEATURE:1cxx_generalized_initializers
    Feature record: CXX_FEATURE:1cxx_generic_lambdas
    Feature record: CXX_FEATURE:1cxx_inheriting_constructors
    Feature record: CXX_FEATURE:1cxx_inline_namespaces
    Feature record: CXX_FEATURE:1cxx_lambdas
    Feature record: CXX_FEATURE:1cxx_lambda_init_captures
    Feature record: CXX_FEATURE:1cxx_local_type_template_args
    Feature record: CXX_FEATURE:1cxx_long_long_type
    Feature record: CXX_FEATURE:1cxx_noexcept
    Feature record: CXX_FEATURE:1cxx_nonstatic_member_init
    Feature record: CXX_FEATURE:1cxx_nullptr
    Feature record: CXX_FEATURE:1cxx_override
    Feature record: CXX_FEATURE:1cxx_range_for
    Feature record: CXX_FEATURE:1cxx_raw_string_literals
    Feature record: CXX_FEATURE:1cxx_reference_qualified_functions
    Feature record: CXX_FEATURE:1cxx_relaxed_constexpr
    Feature record: CXX_FEATURE:1cxx_return_type_deduction
    Feature record: CXX_FEATURE:1cxx_right_angle_brackets
    Feature record: CXX_FEATURE:1cxx_rvalue_references
    Feature record: CXX_FEATURE:1cxx_sizeof_member
    Feature record: CXX_FEATURE:1cxx_static_assert
    Feature record: CXX_FEATURE:1cxx_strong_enums
    Feature record: CXX_FEATURE:1cxx_template_template_parameters
    Feature record: CXX_FEATURE:1cxx_thread_local
    Feature record: CXX_FEATURE:1cxx_trailing_return_types
    Feature record: CXX_FEATURE:1cxx_unicode_literals
    Feature record: CXX_FEATURE:1cxx_uniform_initialization
    Feature record: CXX_FEATURE:1cxx_unrestricted_unions
    Feature record: CXX_FEATURE:1cxx_user_literals
    Feature record: CXX_FEATURE:1cxx_variable_templates
    Feature record: CXX_FEATURE:1cxx_variadic_macros
    Feature record: CXX_FEATURE:1cxx_variadic_templates


Detecting CXX [-std=c++11] compiler features compiled with the following output:
Change Dir: /home/centos/smoketest/PR-14916/build/CMakeFiles/CMakeTmp

Run Build Command:"/opt/rh/devtoolset-7/root/usr/bin/gmake" "cmTC_c461a/fast"
/opt/rh/devtoolset-7/root/usr/bin/gmake -f CMakeFiles/cmTC_c461a.dir/build.make CMakeFiles/cmTC_c461a.dir/build
gmake[1]: Entering directory '/home/centos/smoketest/PR-14916/build/CMakeFiles/CMakeTmp'
Building CXX object CMakeFiles/cmTC_c461a.dir/feature_tests.cxx.o
/opt/rh/devtoolset-7/root/usr/bin/c++    -std=c++11 -o CMakeFiles/cmTC_c461a.dir/feature_tests.cxx.o -c /home/centos/smoketest/PR-14916/build/CMakeFiles/feature_tests.cxx
Linking CXX executable cmTC_c461a
/usr/local/bin/cmake -E cmake_link_script CMakeFiles/cmTC_c461a.dir/link.txt --verbose=1
/opt/rh/devtoolset-7/root/usr/bin/c++       -rdynamic CMakeFiles/cmTC_c461a.dir/feature_tests.cxx.o  -o cmTC_c461a 
gmake[1]: Leaving directory '/home/centos/smoketest/PR-14916/build/CMakeFiles/CMakeTmp'


    Feature record: CXX_FEATURE:0cxx_aggregate_default_initializers
    Feature record: CXX_FEATURE:1cxx_alias_templates
    Feature record: CXX_FEATURE:1cxx_alignas
    Feature record: CXX_FEATURE:1cxx_alignof
    Feature record: CXX_FEATURE:1cxx_attributes
    Feature record: CXX_FEATURE:0cxx_attribute_deprecated
    Feature record: CXX_FEATURE:1cxx_auto_type
    Feature record: CXX_FEATURE:0cxx_binary_literals
    Feature record: CXX_FEATURE:1cxx_constexpr
    Feature record: CXX_FEATURE:0cxx_contextual_conversions
    Feature record: CXX_FEATURE:1cxx_decltype
    Feature record: CXX_FEATURE:0cxx_decltype_auto
    Feature record: CXX_FEATURE:1cxx_decltype_incomplete_return_types
    Feature record: CXX_FEATURE:1cxx_default_function_template_args
    Feature record: CXX_FEATURE:1cxx_defaulted_functions
    Feature record: CXX_FEATURE:1cxx_defaulted_move_initializers
    Feature record: CXX_FEATURE:1cxx_delegating_constructors
    Feature record: CXX_FEATURE:1cxx_deleted_functions
    Feature record: CXX_FEATURE:0cxx_digit_separators
    Feature record: CXX_FEATURE:1cxx_enum_forward_declarations
    Feature record: CXX_FEATURE:1cxx_explicit_conversions
    Feature record: CXX_FEATURE:1cxx_extended_friend_declarations
    Feature record: CXX_FEATURE:1cxx_extern_templates
    Feature record: CXX_FEATURE:1cxx_final
    Feature record: CXX_FEATURE:1cxx_func_identifier
    Feature record: CXX_FEATURE:1cxx_generalized_initializers
    Feature record: CXX_FEATURE:0cxx_generic_lambdas
    Feature record: CXX_FEATURE:1cxx_inheriting_constructors
    Feature record: CXX_FEATURE:1cxx_inline_namespaces
    Feature record: CXX_FEATURE:1cxx_lambdas
    Feature record: CXX_FEATURE:0cxx_lambda_init_captures
    Feature record: CXX_FEATURE:1cxx_local_type_template_args
    Feature record: CXX_FEATURE:1cxx_long_long_type
    Feature record: CXX_FEATURE:1cxx_noexcept
    Feature record: CXX_FEATURE:1cxx_nonstatic_member_init
    Feature record: CXX_FEATURE:1cxx_nullptr
    Feature record: CXX_FEATURE:1cxx_override
    Feature record: CXX_FEATURE:1cxx_range_for
    Feature record: CXX_FEATURE:1cxx_raw_string_literals
    Feature record: CXX_FEATURE:1cxx_reference_qualified_functions
    Feature record: CXX_FEATURE:0cxx_relaxed_constexpr
    Feature record: CXX_FEATURE:0cxx_return_type_deduction
    Feature record: CXX_FEATURE:1cxx_right_angle_brackets
    Feature record: CXX_FEATURE:1cxx_rvalue_references
    Feature record: CXX_FEATURE:1cxx_sizeof_member
    Feature record: CXX_FEATURE:1cxx_static_assert
    Feature record: CXX_FEATURE:1cxx_strong_enums
    Feature record: CXX_FEATURE:1cxx_template_template_parameters
    Feature record: CXX_FEATURE:1cxx_thread_local
    Feature record: CXX_FEATURE:1cxx_trailing_return_types
    Feature record: CXX_FEATURE:1cxx_unicode_literals
    Feature record: CXX_FEATURE:1cxx_uniform_initialization
    Feature record: CXX_FEATURE:1cxx_unrestricted_unions
    Feature record: CXX_FEATURE:1cxx_user_literals
    Feature record: CXX_FEATURE:0cxx_variable_templates
    Feature record: CXX_FEATURE:1cxx_variadic_macros
    Feature record: CXX_FEATURE:1cxx_variadic_templates


Detecting CXX [-std=c++98] compiler features compiled with the following output:
Change Dir: /home/centos/smoketest/PR-14916/build/CMakeFiles/CMakeTmp

Run Build Command:"/opt/rh/devtoolset-7/root/usr/bin/gmake" "cmTC_30dcb/fast"
/opt/rh/devtoolset-7/root/usr/bin/gmake -f CMakeFiles/cmTC_30dcb.dir/build.make CMakeFiles/cmTC_30dcb.dir/build
gmake[1]: Entering directory '/home/centos/smoketest/PR-14916/build/CMakeFiles/CMakeTmp'
Building CXX object CMakeFiles/cmTC_30dcb.dir/feature_tests.cxx.o
/opt/rh/devtoolset-7/root/usr/bin/c++    -std=c++98 -o CMakeFiles/cmTC_30dcb.dir/feature_tests.cxx.o -c /home/centos/smoketest/PR-14916/build/CMakeFiles/feature_tests.cxx
Linking CXX executable cmTC_30dcb
/usr/local/bin/cmake -E cmake_link_script CMakeFiles/cmTC_30dcb.dir/link.txt --verbose=1
/opt/rh/devtoolset-7/root/usr/bin/c++       -rdynamic CMakeFiles/cmTC_30dcb.dir/feature_tests.cxx.o  -o cmTC_30dcb 
gmake[1]: Leaving directory '/home/centos/smoketest/PR-14916/build/CMakeFiles/CMakeTmp'


    Feature record: CXX_FEATURE:0cxx_aggregate_default_initializers
    Feature record: CXX_FEATURE:0cxx_alias_templates
    Feature record: CXX_FEATURE:0cxx_alignas
    Feature record: CXX_FEATURE:0cxx_alignof
    Feature record: CXX_FEATURE:0cxx_attributes
    Feature record: CXX_FEATURE:0cxx_attribute_deprecated
    Feature record: CXX_FEATURE:0cxx_auto_type
    Feature record: CXX_FEATURE:0cxx_binary_literals
    Feature record: CXX_FEATURE:0cxx_constexpr
    Feature record: CXX_FEATURE:0cxx_contextual_conversions
    Feature record: CXX_FEATURE:0cxx_decltype
    Feature record: CXX_FEATURE:0cxx_decltype_auto
    Feature record: CXX_FEATURE:0cxx_decltype_incomplete_return_types
    Feature record: CXX_FEATURE:0cxx_default_function_template_args
    Feature record: CXX_FEATURE:0cxx_defaulted_functions
    Feature record: CXX_FEATURE:0cxx_defaulted_move_initializers
    Feature record: CXX_FEATURE:0cxx_delegating_constructors
    Feature record: CXX_FEATURE:0cxx_deleted_functions
    Feature record: CXX_FEATURE:0cxx_digit_separators
    Feature record: CXX_FEATURE:0cxx_enum_forward_declarations
    Feature record: CXX_FEATURE:0cxx_explicit_conversions
    Feature record: CXX_FEATURE:0cxx_extended_friend_declarations
    Feature record: CXX_FEATURE:0cxx_extern_templates
    Feature record: CXX_FEATURE:0cxx_final
    Feature record: CXX_FEATURE:0cxx_func_identifier
    Feature record: CXX_FEATURE:0cxx_generalized_initializers
    Feature record: CXX_FEATURE:0cxx_generic_lambdas
    Feature record: CXX_FEATURE:0cxx_inheriting_constructors
    Feature record: CXX_FEATURE:0cxx_inline_namespaces
    Feature record: CXX_FEATURE:0cxx_lambdas
    Feature record: CXX_FEATURE:0cxx_lambda_init_captures
    Feature record: CXX_FEATURE:0cxx_local_type_template_args
    Feature record: CXX_FEATURE:0cxx_long_long_type
    Feature record: CXX_FEATURE:0cxx_noexcept
    Feature record: CXX_FEATURE:0cxx_nonstatic_member_init
    Feature record: CXX_FEATURE:0cxx_nullptr
    Feature record: CXX_FEATURE:0cxx_override
    Feature record: CXX_FEATURE:0cxx_range_for
    Feature record: CXX_FEATURE:0cxx_raw_string_literals
    Feature record: CXX_FEATURE:0cxx_reference_qualified_functions
    Feature record: CXX_FEATURE:0cxx_relaxed_constexpr
    Feature record: CXX_FEATURE:0cxx_return_type_deduction
    Feature record: CXX_FEATURE:0cxx_right_angle_brackets
    Feature record: CXX_FEATURE:0cxx_rvalue_references
    Feature record: CXX_FEATURE:0cxx_sizeof_member
    Feature record: CXX_FEATURE:0cxx_static_assert
    Feature record: CXX_FEATURE:0cxx_strong_enums
    Feature record: CXX_FEATURE:1cxx_template_template_parameters
    Feature record: CXX_FEATURE:0cxx_thread_local
    Feature record: CXX_FEATURE:0cxx_trailing_return_types
    Feature record: CXX_FEATURE:0cxx_unicode_literals
    Feature record: CXX_FEATURE:0cxx_uniform_initialization
    Feature record: CXX_FEATURE:0cxx_unrestricted_unions
    Feature record: CXX_FEATURE:0cxx_user_literals
    Feature record: CXX_FEATURE:0cxx_variable_templates
    Feature record: CXX_FEATURE:0cxx_variadic_macros
    Feature record: CXX_FEATURE:0cxx_variadic_templates
Determining if the include file pthread.h exists passed with the following output:
Change Dir: /home/centos/smoketest/PR-14916/build/CMakeFiles/CMakeTmp

Run Build Command:"/opt/rh/devtoolset-7/root/usr/bin/gmake" "cmTC_d3f38/fast"
/opt/rh/devtoolset-7/root/usr/bin/gmake -f CMakeFiles/cmTC_d3f38.dir/build.make CMakeFiles/cmTC_d3f38.dir/build
gmake[1]: Entering directory '/home/centos/smoketest/PR-14916/build/CMakeFiles/CMakeTmp'
Building C object CMakeFiles/cmTC_d3f38.dir/CheckIncludeFile.c.o
/opt/rh/devtoolset-7/root/usr/bin/cc    -o CMakeFiles/cmTC_d3f38.dir/CheckIncludeFile.c.o   -c /home/centos/smoketest/PR-14916/build/CMakeFiles/CMakeTmp/CheckIncludeFile.c
Linking C executable cmTC_d3f38
/usr/local/bin/cmake -E cmake_link_script CMakeFiles/cmTC_d3f38.dir/link.txt --verbose=1
/opt/rh/devtoolset-7/root/usr/bin/cc      CMakeFiles/cmTC_d3f38.dir/CheckIncludeFile.c.o  -o cmTC_d3f38 
gmake[1]: Leaving directory '/home/centos/smoketest/PR-14916/build/CMakeFiles/CMakeTmp'


Determining if the function pthread_create exists in the pthread passed with the following output:
Change Dir: /home/centos/smoketest/PR-14916/build/CMakeFiles/CMakeTmp

Run Build Command:"/opt/rh/devtoolset-7/root/usr/bin/gmake" "cmTC_6d2a7/fast"
/opt/rh/devtoolset-7/root/usr/bin/gmake -f CMakeFiles/cmTC_6d2a7.dir/build.make CMakeFiles/cmTC_6d2a7.dir/build
gmake[1]: Entering directory '/home/centos/smoketest/PR-14916/build/CMakeFiles/CMakeTmp'
Building C object CMakeFiles/cmTC_6d2a7.dir/CheckFunctionExists.c.o
/opt/rh/devtoolset-7/root/usr/bin/cc   -DCHECK_FUNCTION_EXISTS=pthread_create   -o CMakeFiles/cmTC_6d2a7.dir/CheckFunctionExists.c.o   -c /usr/local/share/cmake-3.13/Modules/CheckFunctionExists.c
Linking C executable cmTC_6d2a7
/usr/local/bin/cmake -E cmake_link_script CMakeFiles/cmTC_6d2a7.dir/link.txt --verbose=1
/opt/rh/devtoolset-7/root/usr/bin/cc  -DCHECK_FUNCTION_EXISTS=pthread_create    CMakeFiles/cmTC_6d2a7.dir/CheckFunctionExists.c.o  -o cmTC_6d2a7 -lpthread 
gmake[1]: Leaving directory '/home/centos/smoketest/PR-14916/build/CMakeFiles/CMakeTmp'


Determining if the function dlopen exists in the dl passed with the following output:
Change Dir: /home/centos/smoketest/PR-14916/build/CMakeFiles/CMakeTmp

Run Build Command:"/opt/rh/devtoolset-7/root/usr/bin/gmake" "cmTC_1b98e/fast"
/opt/rh/devtoolset-7/root/usr/bin/gmake -f CMakeFiles/cmTC_1b98e.dir/build.make CMakeFiles/cmTC_1b98e.dir/build
gmake[1]: Entering directory '/home/centos/smoketest/PR-14916/build/CMakeFiles/CMakeTmp'
Building C object CMakeFiles/cmTC_1b98e.dir/CheckFunctionExists.c.o
/opt/rh/devtoolset-7/root/usr/bin/cc   -DCHECK_FUNCTION_EXISTS=dlopen   -o CMakeFiles/cmTC_1b98e.dir/CheckFunctionExists.c.o   -c /usr/local/share/cmake-3.13/Modules/CheckFunctionExists.c
Linking C executable cmTC_1b98e
/usr/local/bin/cmake -E cmake_link_script CMakeFiles/cmTC_1b98e.dir/link.txt --verbose=1
/opt/rh/devtoolset-7/root/usr/bin/cc  -DCHECK_FUNCTION_EXISTS=dlopen   -Wl,-z,defs  CMakeFiles/cmTC_1b98e.dir/CheckFunctionExists.c.o  -o cmTC_1b98e -ldl 
gmake[1]: Leaving directory '/home/centos/smoketest/PR-14916/build/CMakeFiles/CMakeTmp'


Determining if the function crypt exists in the crypt passed with the following output:
Change Dir: /home/centos/smoketest/PR-14916/build/CMakeFiles/CMakeTmp

Run Build Command:"/opt/rh/devtoolset-7/root/usr/bin/gmake" "cmTC_e57b7/fast"
/opt/rh/devtoolset-7/root/usr/bin/gmake -f CMakeFiles/cmTC_e57b7.dir/build.make CMakeFiles/cmTC_e57b7.dir/build
gmake[1]: Entering directory '/home/centos/smoketest/PR-14916/build/CMakeFiles/CMakeTmp'
Building C object CMakeFiles/cmTC_e57b7.dir/CheckFunctionExists.c.o
/opt/rh/devtoolset-7/root/usr/bin/cc   -DCHECK_FUNCTION_EXISTS=crypt   -o CMakeFiles/cmTC_e57b7.dir/CheckFunctionExists.c.o   -c /usr/local/share/cmake-3.13/Modules/CheckFunctionExists.c
Linking C executable cmTC_e57b7
/usr/local/bin/cmake -E cmake_link_script CMakeFiles/cmTC_e57b7.dir/link.txt --verbose=1
/opt/rh/devtoolset-7/root/usr/bin/cc  -DCHECK_FUNCTION_EXISTS=crypt   -Wl,-z,defs  CMakeFiles/cmTC_e57b7.dir/CheckFunctionExists.c.o  -o cmTC_e57b7 -lcrypt 
gmake[1]: Leaving directory '/home/centos/smoketest/PR-14916/build/CMakeFiles/CMakeTmp'


Determining if the include file uuid/uuid.h exists passed with the following output:
Change Dir: /home/centos/smoketest/PR-14916/build/CMakeFiles/CMakeTmp

Run Build Command:"/opt/rh/devtoolset-7/root/usr/bin/gmake" "cmTC_1683b/fast"
/opt/rh/devtoolset-7/root/usr/bin/gmake -f CMakeFiles/cmTC_1683b.dir/build.make CMakeFiles/cmTC_1683b.dir/build
gmake[1]: Entering directory '/home/centos/smoketest/PR-14916/build/CMakeFiles/CMakeTmp'
Building C object CMakeFiles/cmTC_1683b.dir/CheckIncludeFile.c.o
/opt/rh/devtoolset-7/root/usr/bin/cc -D_GNU_SOURCE  -std=c11 -o CMakeFiles/cmTC_1683b.dir/CheckIncludeFile.c.o   -c /home/centos/smoketest/PR-14916/build/CMakeFiles/CMakeTmp/CheckIncludeFile.c
Linking C executable cmTC_1683b
/usr/local/bin/cmake -E cmake_link_script CMakeFiles/cmTC_1683b.dir/link.txt --verbose=1
/opt/rh/devtoolset-7/root/usr/bin/cc     -Wl,-z,defs  CMakeFiles/cmTC_1683b.dir/CheckIncludeFile.c.o  -o cmTC_1683b 
gmake[1]: Leaving directory '/home/centos/smoketest/PR-14916/build/CMakeFiles/CMakeTmp'


Determining if the uuid_generate exist passed with the following output:
Change Dir: /home/centos/smoketest/PR-14916/build/CMakeFiles/CMakeTmp

Run Build Command:"/opt/rh/devtoolset-7/root/usr/bin/gmake" "cmTC_ce29c/fast"
/opt/rh/devtoolset-7/root/usr/bin/gmake -f CMakeFiles/cmTC_ce29c.dir/build.make CMakeFiles/cmTC_ce29c.dir/build
gmake[1]: Entering directory '/home/centos/smoketest/PR-14916/build/CMakeFiles/CMakeTmp'
Building C object CMakeFiles/cmTC_ce29c.dir/CheckSymbolExists.c.o
/opt/rh/devtoolset-7/root/usr/bin/cc -D_GNU_SOURCE  -std=c11 -o CMakeFiles/cmTC_ce29c.dir/CheckSymbolExists.c.o   -c /home/centos/smoketest/PR-14916/build/CMakeFiles/CMakeTmp/CheckSymbolExists.c
Linking C executable cmTC_ce29c
/usr/local/bin/cmake -E cmake_link_script CMakeFiles/cmTC_ce29c.dir/link.txt --verbose=1
/opt/rh/devtoolset-7/root/usr/bin/cc     -Wl,-z,defs  CMakeFiles/cmTC_ce29c.dir/CheckSymbolExists.c.o  -o cmTC_ce29c -lbsd -luuid 
gmake[1]: Leaving directory '/home/centos/smoketest/PR-14916/build/CMakeFiles/CMakeTmp'

File /home/centos/smoketest/PR-14916/build/CMakeFiles/CMakeTmp/CheckSymbolExists.c:
/* */
#include 

int main(int argc, char** argv)
{
  (void)argv;
#ifndef uuid_generate
  return ((int*)(&uuid_generate))[argc];
#else
  (void)argc;
  return 0;
#endif
}

Determining if the poll exist passed with the following output:
Change Dir: /home/centos/smoketest/PR-14916/build/CMakeFiles/CMakeTmp

Run Build Command:"/opt/rh/devtoolset-7/root/usr/bin/gmake" "cmTC_08d92/fast"
/opt/rh/devtoolset-7/root/usr/bin/gmake -f CMakeFiles/cmTC_08d92.dir/build.make CMakeFiles/cmTC_08d92.dir/build
gmake[1]: Entering directory '/home/centos/smoketest/PR-14916/build/CMakeFiles/CMakeTmp'
Building C object CMakeFiles/cmTC_08d92.dir/CheckSymbolExists.c.o
/opt/rh/devtoolset-7/root/usr/bin/cc -D_GNU_SOURCE  -std=c11 -o CMakeFiles/cmTC_08d92.dir/CheckSymbolExists.c.o   -c /home/centos/smoketest/PR-14916/build/CMakeFiles/CMakeTmp/CheckSymbolExists.c
Linking C executable cmTC_08d92
/usr/local/bin/cmake -E cmake_link_script CMakeFiles/cmTC_08d92.dir/link.txt --verbose=1
/opt/rh/devtoolset-7/root/usr/bin/cc     -Wl,-z,defs  CMakeFiles/cmTC_08d92.dir/CheckSymbolExists.c.o  -o cmTC_08d92 -lbsd -luuid 
gmake[1]: Leaving directory '/home/centos/smoketest/PR-14916/build/CMakeFiles/CMakeTmp'

File /home/centos/smoketest/PR-14916/build/CMakeFiles/CMakeTmp/CheckSymbolExists.c:
/* */
#include 

int main(int argc, char** argv)
{
  (void)argv;
#ifndef poll
  return ((int*)(&poll))[argc];
#else
  (void)argc;
  return 0;
#endif
}

Determining if the epoll_create exist passed with the following output:
Change Dir: /home/centos/smoketest/PR-14916/build/CMakeFiles/CMakeTmp

Run Build Command:"/opt/rh/devtoolset-7/root/usr/bin/gmake" "cmTC_cb16d/fast"
/opt/rh/devtoolset-7/root/usr/bin/gmake -f CMakeFiles/cmTC_cb16d.dir/build.make CMakeFiles/cmTC_cb16d.dir/build
gmake[1]: Entering directory '/home/centos/smoketest/PR-14916/build/CMakeFiles/CMakeTmp'
Building C object CMakeFiles/cmTC_cb16d.dir/CheckSymbolExists.c.o
/opt/rh/devtoolset-7/root/usr/bin/cc -D_GNU_SOURCE  -std=c11 -o CMakeFiles/cmTC_cb16d.dir/CheckSymbolExists.c.o   -c /home/centos/smoketest/PR-14916/build/CMakeFiles/CMakeTmp/CheckSymbolExists.c
Linking C executable cmTC_cb16d
/usr/local/bin/cmake -E cmake_link_script CMakeFiles/cmTC_cb16d.dir/link.txt --verbose=1
/opt/rh/devtoolset-7/root/usr/bin/cc     -Wl,-z,defs  CMakeFiles/cmTC_cb16d.dir/CheckSymbolExists.c.o  -o cmTC_cb16d -lbsd -luuid 
gmake[1]: Leaving directory '/home/centos/smoketest/PR-14916/build/CMakeFiles/CMakeTmp'

File /home/centos/smoketest/PR-14916/build/CMakeFiles/CMakeTmp/CheckSymbolExists.c:
/* */
#include 

int main(int argc, char** argv)
{
  (void)argv;
#ifndef epoll_create
  return ((int*)(&epoll_create))[argc];
#else
  (void)argc;
  return 0;
#endif
}

Determining if the include file sys/types.h exists passed with the following output:
Change Dir: /home/centos/smoketest/PR-14916/build/CMakeFiles/CMakeTmp

Run Build Command:"/opt/rh/devtoolset-7/root/usr/bin/gmake" "cmTC_f9682/fast"
/opt/rh/devtoolset-7/root/usr/bin/gmake -f CMakeFiles/cmTC_f9682.dir/build.make CMakeFiles/cmTC_f9682.dir/build
gmake[1]: Entering directory '/home/centos/smoketest/PR-14916/build/CMakeFiles/CMakeTmp'
Building C object CMakeFiles/cmTC_f9682.dir/CheckIncludeFile.c.o
/opt/rh/devtoolset-7/root/usr/bin/cc -D_GNU_SOURCE  -std=c11 -o CMakeFiles/cmTC_f9682.dir/CheckIncludeFile.c.o   -c /home/centos/smoketest/PR-14916/build/CMakeFiles/CMakeTmp/CheckIncludeFile.c
Linking C executable cmTC_f9682
/usr/local/bin/cmake -E cmake_link_script CMakeFiles/cmTC_f9682.dir/link.txt --verbose=1
/opt/rh/devtoolset-7/root/usr/bin/cc     -Wl,-z,defs  CMakeFiles/cmTC_f9682.dir/CheckIncludeFile.c.o  -o cmTC_f9682 
gmake[1]: Leaving directory '/home/centos/smoketest/PR-14916/build/CMakeFiles/CMakeTmp'


Determining if the include file stdint.h exists passed with the following output:
Change Dir: /home/centos/smoketest/PR-14916/build/CMakeFiles/CMakeTmp

Run Build Command:"/opt/rh/devtoolset-7/root/usr/bin/gmake" "cmTC_7d8c2/fast"
/opt/rh/devtoolset-7/root/usr/bin/gmake -f CMakeFiles/cmTC_7d8c2.dir/build.make CMakeFiles/cmTC_7d8c2.dir/build
gmake[1]: Entering directory '/home/centos/smoketest/PR-14916/build/CMakeFiles/CMakeTmp'
Building C object CMakeFiles/cmTC_7d8c2.dir/CheckIncludeFile.c.o
/opt/rh/devtoolset-7/root/usr/bin/cc -D_GNU_SOURCE  -std=c11 -o CMakeFiles/cmTC_7d8c2.dir/CheckIncludeFile.c.o   -c /home/centos/smoketest/PR-14916/build/CMakeFiles/CMakeTmp/CheckIncludeFile.c
Linking C executable cmTC_7d8c2
/usr/local/bin/cmake -E cmake_link_script CMakeFiles/cmTC_7d8c2.dir/link.txt --verbose=1
/opt/rh/devtoolset-7/root/usr/bin/cc     -Wl,-z,defs  CMakeFiles/cmTC_7d8c2.dir/CheckIncludeFile.c.o  -o cmTC_7d8c2 
gmake[1]: Leaving directory '/home/centos/smoketest/PR-14916/build/CMakeFiles/CMakeTmp'


Determining if the include file stddef.h exists passed with the following output:
Change Dir: /home/centos/smoketest/PR-14916/build/CMakeFiles/CMakeTmp

Run Build Command:"/opt/rh/devtoolset-7/root/usr/bin/gmake" "cmTC_3bb01/fast"
/opt/rh/devtoolset-7/root/usr/bin/gmake -f CMakeFiles/cmTC_3bb01.dir/build.make CMakeFiles/cmTC_3bb01.dir/build
gmake[1]: Entering directory '/home/centos/smoketest/PR-14916/build/CMakeFiles/CMakeTmp'
Building C object CMakeFiles/cmTC_3bb01.dir/CheckIncludeFile.c.o
/opt/rh/devtoolset-7/root/usr/bin/cc -D_GNU_SOURCE  -std=c11 -o CMakeFiles/cmTC_3bb01.dir/CheckIncludeFile.c.o   -c /home/centos/smoketest/PR-14916/build/CMakeFiles/CMakeTmp/CheckIncludeFile.c
Linking C executable cmTC_3bb01
/usr/local/bin/cmake -E cmake_link_script CMakeFiles/cmTC_3bb01.dir/link.txt --verbose=1
/opt/rh/devtoolset-7/root/usr/bin/cc     -Wl,-z,defs  CMakeFiles/cmTC_3bb01.dir/CheckIncludeFile.c.o  -o cmTC_3bb01 
gmake[1]: Leaving directory '/home/centos/smoketest/PR-14916/build/CMakeFiles/CMakeTmp'


Determining size of struct mmsghdr passed with the following output:
Change Dir: /home/centos/smoketest/PR-14916/build/CMakeFiles/CMakeTmp

Run Build Command:"/opt/rh/devtoolset-7/root/usr/bin/gmake" "cmTC_0fd68/fast"
/opt/rh/devtoolset-7/root/usr/bin/gmake -f CMakeFiles/cmTC_0fd68.dir/build.make CMakeFiles/cmTC_0fd68.dir/build
gmake[1]: Entering directory '/home/centos/smoketest/PR-14916/build/CMakeFiles/CMakeTmp'
Building C object CMakeFiles/cmTC_0fd68.dir/STRUCT_MMSGHDR_TYPE_EXISTS.c.o
/opt/rh/devtoolset-7/root/usr/bin/cc -D_GNU_SOURCE   -o CMakeFiles/cmTC_0fd68.dir/STRUCT_MMSGHDR_TYPE_EXISTS.c.o   -c /home/centos/smoketest/PR-14916/build/CMakeFiles/CheckTypeSize/STRUCT_MMSGHDR_TYPE_EXISTS.c
Linking C executable cmTC_0fd68
/usr/local/bin/cmake -E cmake_link_script CMakeFiles/cmTC_0fd68.dir/link.txt --verbose=1
/opt/rh/devtoolset-7/root/usr/bin/cc      -rdynamic CMakeFiles/cmTC_0fd68.dir/STRUCT_MMSGHDR_TYPE_EXISTS.c.o  -o cmTC_0fd68 -lbsd -luuid 
gmake[1]: Leaving directory '/home/centos/smoketest/PR-14916/build/CMakeFiles/CMakeTmp'


Determining if the recvmmsg exist passed with the following output:
Change Dir: /home/centos/smoketest/PR-14916/build/CMakeFiles/CMakeTmp

Run Build Command:"/opt/rh/devtoolset-7/root/usr/bin/gmake" "cmTC_48000/fast"
/opt/rh/devtoolset-7/root/usr/bin/gmake -f CMakeFiles/cmTC_48000.dir/build.make CMakeFiles/cmTC_48000.dir/build
gmake[1]: Entering directory '/home/centos/smoketest/PR-14916/build/CMakeFiles/CMakeTmp'
Building C object CMakeFiles/cmTC_48000.dir/CheckSymbolExists.c.o
/opt/rh/devtoolset-7/root/usr/bin/cc -D_GNU_SOURCE  -std=c11 -o CMakeFiles/cmTC_48000.dir/CheckSymbolExists.c.o   -c /home/centos/smoketest/PR-14916/build/CMakeFiles/CMakeTmp/CheckSymbolExists.c
Linking C executable cmTC_48000
/usr/local/bin/cmake -E cmake_link_script CMakeFiles/cmTC_48000.dir/link.txt --verbose=1
/opt/rh/devtoolset-7/root/usr/bin/cc     -Wl,-z,defs  CMakeFiles/cmTC_48000.dir/CheckSymbolExists.c.o  -o cmTC_48000 -lbsd -luuid 
gmake[1]: Leaving directory '/home/centos/smoketest/PR-14916/build/CMakeFiles/CMakeTmp'

File /home/centos/smoketest/PR-14916/build/CMakeFiles/CMakeTmp/CheckSymbolExists.c:
/* */
#include 

int main(int argc, char** argv)
{
  (void)argv;
#ifndef recvmmsg
  return ((int*)(&recvmmsg))[argc];
#else
  (void)argc;
  return 0;
#endif
}

Determining if the sendmmsg exist passed with the following output:
Change Dir: /home/centos/smoketest/PR-14916/build/CMakeFiles/CMakeTmp

Run Build Command:"/opt/rh/devtoolset-7/root/usr/bin/gmake" "cmTC_a38fe/fast"
/opt/rh/devtoolset-7/root/usr/bin/gmake -f CMakeFiles/cmTC_a38fe.dir/build.make CMakeFiles/cmTC_a38fe.dir/build
gmake[1]: Entering directory '/home/centos/smoketest/PR-14916/build/CMakeFiles/CMakeTmp'
Building C object CMakeFiles/cmTC_a38fe.dir/CheckSymbolExists.c.o
/opt/rh/devtoolset-7/root/usr/bin/cc -D_GNU_SOURCE  -std=c11 -o CMakeFiles/cmTC_a38fe.dir/CheckSymbolExists.c.o   -c /home/centos/smoketest/PR-14916/build/CMakeFiles/CMakeTmp/CheckSymbolExists.c
Linking C executable cmTC_a38fe
/usr/local/bin/cmake -E cmake_link_script CMakeFiles/cmTC_a38fe.dir/link.txt --verbose=1
/opt/rh/devtoolset-7/root/usr/bin/cc     -Wl,-z,defs  CMakeFiles/cmTC_a38fe.dir/CheckSymbolExists.c.o  -o cmTC_a38fe -lbsd -luuid 
gmake[1]: Leaving directory '/home/centos/smoketest/PR-14916/build/CMakeFiles/CMakeTmp'

File /home/centos/smoketest/PR-14916/build/CMakeFiles/CMakeTmp/CheckSymbolExists.c:
/* */
#include 

int main(int argc, char** argv)
{
  (void)argv;
#ifndef sendmmsg
  return ((int*)(&sendmmsg))[argc];
#else
  (void)argc;
  return 0;
#endif
}

Determining if the fallocate exist passed with the following output:
Change Dir: /home/centos/smoketest/PR-14916/build/CMakeFiles/CMakeTmp

Run Build Command:"/opt/rh/devtoolset-7/root/usr/bin/gmake" "cmTC_e1d5b/fast"
/opt/rh/devtoolset-7/root/usr/bin/gmake -f CMakeFiles/cmTC_e1d5b.dir/build.make CMakeFiles/cmTC_e1d5b.dir/build
gmake[1]: Entering directory '/home/centos/smoketest/PR-14916/build/CMakeFiles/CMakeTmp'
Building C object CMakeFiles/cmTC_e1d5b.dir/CheckSymbolExists.c.o
/opt/rh/devtoolset-7/root/usr/bin/cc -D_GNU_SOURCE  -std=c11 -o CMakeFiles/cmTC_e1d5b.dir/CheckSymbolExists.c.o   -c /home/centos/smoketest/PR-14916/build/CMakeFiles/CMakeTmp/CheckSymbolExists.c
Linking C executable cmTC_e1d5b
/usr/local/bin/cmake -E cmake_link_script CMakeFiles/cmTC_e1d5b.dir/link.txt --verbose=1
/opt/rh/devtoolset-7/root/usr/bin/cc     -Wl,-z,defs  CMakeFiles/cmTC_e1d5b.dir/CheckSymbolExists.c.o  -o cmTC_e1d5b -lbsd -luuid 
gmake[1]: Leaving directory '/home/centos/smoketest/PR-14916/build/CMakeFiles/CMakeTmp'

File /home/centos/smoketest/PR-14916/build/CMakeFiles/CMakeTmp/CheckSymbolExists.c:
/* */
#include 

int main(int argc, char** argv)
{
  (void)argv;
#ifndef fallocate
  return ((int*)(&fallocate))[argc];
#else
  (void)argc;
  return 0;
#endif
}

Determining if the CXX compiler accepts the flag -std=c++11 passed with the following output:
Change Dir: /home/centos/smoketest/PR-14916/build/CMakeFiles/CMakeTmp

Run Build Command:"/opt/rh/devtoolset-7/root/usr/bin/gmake" "cmTC_d6157/fast"
/opt/rh/devtoolset-7/root/usr/bin/gmake -f CMakeFiles/cmTC_d6157.dir/build.make CMakeFiles/cmTC_d6157.dir/build
gmake[1]: Entering directory '/home/centos/smoketest/PR-14916/build/CMakeFiles/CMakeTmp'
Building CXX object CMakeFiles/cmTC_d6157.dir/DummyCXXFile.cxx.o
/opt/rh/devtoolset-7/root/usr/bin/c++    -frtti -fPIC -fmessage-length=0 -Werror=format -Wformat-security -Wformat-nonliteral -pthread -Wuninitialized -Werror=return-type -Werror=format-nonliteral -Wno-psabi -Wparentheses -std=c++11 -std=c++11   -o CMakeFiles/cmTC_d6157.dir/DummyCXXFile.cxx.o -c /usr/local/share/cmake-3.13/Modules/DummyCXXFile.cxx
Linking CXX executable cmTC_d6157
/usr/local/bin/cmake -E cmake_link_script CMakeFiles/cmTC_d6157.dir/link.txt --verbose=1
/opt/rh/devtoolset-7/root/usr/bin/c++   -frtti -fPIC -fmessage-length=0 -Werror=format -Wformat-security -Wformat-nonliteral -pthread -Wuninitialized -Werror=return-type -Werror=format-nonliteral -Wno-psabi -Wparentheses -std=c++11 -std=c++11    -rdynamic CMakeFiles/cmTC_d6157.dir/DummyCXXFile.cxx.o  -o cmTC_d6157 
gmake[1]: Leaving directory '/home/centos/smoketest/PR-14916/build/CMakeFiles/CMakeTmp'


Performing C++ SOURCE FILE Test HAVE_UNORDERED_MAP succeeded with the following output:
Change Dir: /home/centos/smoketest/PR-14916/build/CMakeFiles/CMakeTmp

Run Build Command:"/opt/rh/devtoolset-7/root/usr/bin/gmake" "cmTC_42599/fast"
/opt/rh/devtoolset-7/root/usr/bin/gmake -f CMakeFiles/cmTC_42599.dir/build.make CMakeFiles/cmTC_42599.dir/build
gmake[1]: Entering directory '/home/centos/smoketest/PR-14916/build/CMakeFiles/CMakeTmp'
Building CXX object CMakeFiles/cmTC_42599.dir/src.cxx.o
/opt/rh/devtoolset-7/root/usr/bin/c++    -frtti -fPIC -fmessage-length=0 -Werror=format -Wformat-security -Wformat-nonliteral -pthread -Wuninitialized -Werror=return-type -Werror=format-nonliteral -Wno-psabi -Wparentheses -std=c++11 -DHAVE_UNORDERED_MAP  -std=c++11   -o CMakeFiles/cmTC_42599.dir/src.cxx.o -c /home/centos/smoketest/PR-14916/build/CMakeFiles/CMakeTmp/src.cxx
Linking CXX executable cmTC_42599
/usr/local/bin/cmake -E cmake_link_script CMakeFiles/cmTC_42599.dir/link.txt --verbose=1
/opt/rh/devtoolset-7/root/usr/bin/c++   -frtti -fPIC -fmessage-length=0 -Werror=format -Wformat-security -Wformat-nonliteral -pthread -Wuninitialized -Werror=return-type -Werror=format-nonliteral -Wno-psabi -Wparentheses -std=c++11 -DHAVE_UNORDERED_MAP  -std=c++11    -rdynamic CMakeFiles/cmTC_42599.dir/src.cxx.o  -o cmTC_42599 
gmake[1]: Leaving directory '/home/centos/smoketest/PR-14916/build/CMakeFiles/CMakeTmp'

Source file was:

      #include 
      int main() {
        std::unordered_map m;
        return m.find(42) == m.end();
      }
      
Performing C++ SOURCE FILE Test HAVE_HASH_FUNC_HEADER succeeded with the following output:
Change Dir: /home/centos/smoketest/PR-14916/build/CMakeFiles/CMakeTmp

Run Build Command:"/opt/rh/devtoolset-7/root/usr/bin/gmake" "cmTC_08b6d/fast"
/opt/rh/devtoolset-7/root/usr/bin/gmake -f CMakeFiles/cmTC_08b6d.dir/build.make CMakeFiles/cmTC_08b6d.dir/build
gmake[1]: Entering directory '/home/centos/smoketest/PR-14916/build/CMakeFiles/CMakeTmp'
Building CXX object CMakeFiles/cmTC_08b6d.dir/src.cxx.o
/opt/rh/devtoolset-7/root/usr/bin/c++    -frtti -fPIC -fmessage-length=0 -Werror=format -Wformat-security -Wformat-nonliteral -pthread -Wuninitialized -Werror=return-type -Werror=format-nonliteral -Wno-psabi -Wparentheses -std=c++11 -DHAVE_HASH_FUNC_HEADER  -std=c++11   -o CMakeFiles/cmTC_08b6d.dir/src.cxx.o -c /home/centos/smoketest/PR-14916/build/CMakeFiles/CMakeTmp/src.cxx
Linking CXX executable cmTC_08b6d
/usr/local/bin/cmake -E cmake_link_script CMakeFiles/cmTC_08b6d.dir/link.txt --verbose=1
/opt/rh/devtoolset-7/root/usr/bin/c++   -frtti -fPIC -fmessage-length=0 -Werror=format -Wformat-security -Wformat-nonliteral -pthread -Wuninitialized -Werror=return-type -Werror=format-nonliteral -Wno-psabi -Wparentheses -std=c++11 -DHAVE_HASH_FUNC_HEADER  -std=c++11    -rdynamic CMakeFiles/cmTC_08b6d.dir/src.cxx.o  -o cmTC_08b6d 
gmake[1]: Leaving directory '/home/centos/smoketest/PR-14916/build/CMakeFiles/CMakeTmp'

Source file was:

    #include 
    int main() { int x = std::hash()(42); }
    
Determining if the include file inttypes.h exists passed with the following output:
Change Dir: /home/centos/smoketest/PR-14916/build/CMakeFiles/CMakeTmp

Run Build Command:"/opt/rh/devtoolset-7/root/usr/bin/gmake" "cmTC_f5743/fast"
/opt/rh/devtoolset-7/root/usr/bin/gmake -f CMakeFiles/cmTC_f5743.dir/build.make CMakeFiles/cmTC_f5743.dir/build
gmake[1]: Entering directory '/home/centos/smoketest/PR-14916/build/CMakeFiles/CMakeTmp'
Building C object CMakeFiles/cmTC_f5743.dir/CheckIncludeFile.c.o
/opt/rh/devtoolset-7/root/usr/bin/cc   -D_GNU_SOURCE    -o CMakeFiles/cmTC_f5743.dir/CheckIncludeFile.c.o   -c /home/centos/smoketest/PR-14916/build/CMakeFiles/CMakeTmp/CheckIncludeFile.c
Linking C executable cmTC_f5743
/usr/local/bin/cmake -E cmake_link_script CMakeFiles/cmTC_f5743.dir/link.txt --verbose=1
/opt/rh/devtoolset-7/root/usr/bin/cc  -D_GNU_SOURCE    -Wl,-z,defs  CMakeFiles/cmTC_f5743.dir/CheckIncludeFile.c.o  -o cmTC_f5743 
gmake[1]: Leaving directory '/home/centos/smoketest/PR-14916/build/CMakeFiles/CMakeTmp'


Determining if the function memcpy exists passed with the following output:
Change Dir: /home/centos/smoketest/PR-14916/build/CMakeFiles/CMakeTmp

Run Build Command:"/opt/rh/devtoolset-7/root/usr/bin/gmake" "cmTC_4ac6d/fast"
/opt/rh/devtoolset-7/root/usr/bin/gmake -f CMakeFiles/cmTC_4ac6d.dir/build.make CMakeFiles/cmTC_4ac6d.dir/build
gmake[1]: Entering directory '/home/centos/smoketest/PR-14916/build/CMakeFiles/CMakeTmp'
Building C object CMakeFiles/cmTC_4ac6d.dir/CheckFunctionExists.c.o
/opt/rh/devtoolset-7/root/usr/bin/cc   -D_GNU_SOURCE -DCHECK_FUNCTION_EXISTS=memcpy   -o CMakeFiles/cmTC_4ac6d.dir/CheckFunctionExists.c.o   -c /usr/local/share/cmake-3.13/Modules/CheckFunctionExists.c
:0:23: warning: conflicting types for built-in function ‘memcpy’ [-Wbuiltin-declaration-mismatch]
/usr/local/share/cmake-3.13/Modules/CheckFunctionExists.c:7:3: note: in expansion of macro ‘CHECK_FUNCTION_EXISTS’
   CHECK_FUNCTION_EXISTS(void);
   ^~~~~~~~~~~~~~~~~~~~~
Linking C executable cmTC_4ac6d
/usr/local/bin/cmake -E cmake_link_script CMakeFiles/cmTC_4ac6d.dir/link.txt --verbose=1
/opt/rh/devtoolset-7/root/usr/bin/cc  -D_GNU_SOURCE -DCHECK_FUNCTION_EXISTS=memcpy    -rdynamic CMakeFiles/cmTC_4ac6d.dir/CheckFunctionExists.c.o  -o cmTC_4ac6d 
gmake[1]: Leaving directory '/home/centos/smoketest/PR-14916/build/CMakeFiles/CMakeTmp'


Determining size of long long passed with the following output:
Change Dir: /home/centos/smoketest/PR-14916/build/CMakeFiles/CMakeTmp

Run Build Command:"/opt/rh/devtoolset-7/root/usr/bin/gmake" "cmTC_36145/fast"
/opt/rh/devtoolset-7/root/usr/bin/gmake -f CMakeFiles/cmTC_36145.dir/build.make CMakeFiles/cmTC_36145.dir/build
gmake[1]: Entering directory '/home/centos/smoketest/PR-14916/build/CMakeFiles/CMakeTmp'
Building C object CMakeFiles/cmTC_36145.dir/LONG_LONG.c.o
/opt/rh/devtoolset-7/root/usr/bin/cc   -D_GNU_SOURCE    -o CMakeFiles/cmTC_36145.dir/LONG_LONG.c.o   -c /home/centos/smoketest/PR-14916/build/CMakeFiles/CheckTypeSize/LONG_LONG.c
Linking C executable cmTC_36145
/usr/local/bin/cmake -E cmake_link_script CMakeFiles/cmTC_36145.dir/link.txt --verbose=1
/opt/rh/devtoolset-7/root/usr/bin/cc  -D_GNU_SOURCE     -rdynamic CMakeFiles/cmTC_36145.dir/LONG_LONG.c.o  -o cmTC_36145 
gmake[1]: Leaving directory '/home/centos/smoketest/PR-14916/build/CMakeFiles/CMakeTmp'


Determining size of uint16_t passed with the following output:
Change Dir: /home/centos/smoketest/PR-14916/build/CMakeFiles/CMakeTmp

Run Build Command:"/opt/rh/devtoolset-7/root/usr/bin/gmake" "cmTC_ebe34/fast"
/opt/rh/devtoolset-7/root/usr/bin/gmake -f CMakeFiles/cmTC_ebe34.dir/build.make CMakeFiles/cmTC_ebe34.dir/build
gmake[1]: Entering directory '/home/centos/smoketest/PR-14916/build/CMakeFiles/CMakeTmp'
Building C object CMakeFiles/cmTC_ebe34.dir/UINT16_T.c.o
/opt/rh/devtoolset-7/root/usr/bin/cc   -D_GNU_SOURCE    -o CMakeFiles/cmTC_ebe34.dir/UINT16_T.c.o   -c /home/centos/smoketest/PR-14916/build/CMakeFiles/CheckTypeSize/UINT16_T.c
Linking C executable cmTC_ebe34
/usr/local/bin/cmake -E cmake_link_script CMakeFiles/cmTC_ebe34.dir/link.txt --verbose=1
/opt/rh/devtoolset-7/root/usr/bin/cc  -D_GNU_SOURCE     -rdynamic CMakeFiles/cmTC_ebe34.dir/UINT16_T.c.o  -o cmTC_ebe34 
gmake[1]: Leaving directory '/home/centos/smoketest/PR-14916/build/CMakeFiles/CMakeTmp'


Determining size of u_int16_t passed with the following output:
Change Dir: /home/centos/smoketest/PR-14916/build/CMakeFiles/CMakeTmp

Run Build Command:"/opt/rh/devtoolset-7/root/usr/bin/gmake" "cmTC_864a3/fast"
/opt/rh/devtoolset-7/root/usr/bin/gmake -f CMakeFiles/cmTC_864a3.dir/build.make CMakeFiles/cmTC_864a3.dir/build
gmake[1]: Entering directory '/home/centos/smoketest/PR-14916/build/CMakeFiles/CMakeTmp'
Building C object CMakeFiles/cmTC_864a3.dir/U_INT16_T.c.o
/opt/rh/devtoolset-7/root/usr/bin/cc   -D_GNU_SOURCE    -o CMakeFiles/cmTC_864a3.dir/U_INT16_T.c.o   -c /home/centos/smoketest/PR-14916/build/CMakeFiles/CheckTypeSize/U_INT16_T.c
Linking C executable cmTC_864a3
/usr/local/bin/cmake -E cmake_link_script CMakeFiles/cmTC_864a3.dir/link.txt --verbose=1
/opt/rh/devtoolset-7/root/usr/bin/cc  -D_GNU_SOURCE     -rdynamic CMakeFiles/cmTC_864a3.dir/U_INT16_T.c.o  -o cmTC_864a3 
gmake[1]: Leaving directory '/home/centos/smoketest/PR-14916/build/CMakeFiles/CMakeTmp'


Determining size of __uint16_t passed with the following output:
Change Dir: /home/centos/smoketest/PR-14916/build/CMakeFiles/CMakeTmp

Run Build Command:"/opt/rh/devtoolset-7/root/usr/bin/gmake" "cmTC_cf57c/fast"
/opt/rh/devtoolset-7/root/usr/bin/gmake -f CMakeFiles/cmTC_cf57c.dir/build.make CMakeFiles/cmTC_cf57c.dir/build
gmake[1]: Entering directory '/home/centos/smoketest/PR-14916/build/CMakeFiles/CMakeTmp'
Building C object CMakeFiles/cmTC_cf57c.dir/__UINT16_T.c.o
/opt/rh/devtoolset-7/root/usr/bin/cc   -D_GNU_SOURCE    -o CMakeFiles/cmTC_cf57c.dir/__UINT16_T.c.o   -c /home/centos/smoketest/PR-14916/build/CMakeFiles/CheckTypeSize/__UINT16_T.c
Linking C executable cmTC_cf57c
/usr/local/bin/cmake -E cmake_link_script CMakeFiles/cmTC_cf57c.dir/link.txt --verbose=1
/opt/rh/devtoolset-7/root/usr/bin/cc  -D_GNU_SOURCE     -rdynamic CMakeFiles/cmTC_cf57c.dir/__UINT16_T.c.o  -o cmTC_cf57c 
gmake[1]: Leaving directory '/home/centos/smoketest/PR-14916/build/CMakeFiles/CMakeTmp'


Determining if the GRND_NONBLOCK exist passed with the following output:
Change Dir: /home/centos/smoketest/PR-14916/build/CMakeFiles/CMakeTmp

Run Build Command:"/opt/rh/devtoolset-7/root/usr/bin/gmake" "cmTC_bc241/fast"
/opt/rh/devtoolset-7/root/usr/bin/gmake -f CMakeFiles/cmTC_bc241.dir/build.make CMakeFiles/cmTC_bc241.dir/build
gmake[1]: Entering directory '/home/centos/smoketest/PR-14916/build/CMakeFiles/CMakeTmp'
Building C object CMakeFiles/cmTC_bc241.dir/CheckSymbolExists.c.o
/opt/rh/devtoolset-7/root/usr/bin/cc   -D_GNU_SOURCE    -o CMakeFiles/cmTC_bc241.dir/CheckSymbolExists.c.o   -c /home/centos/smoketest/PR-14916/build/CMakeFiles/CMakeTmp/CheckSymbolExists.c
Linking C executable cmTC_bc241
/usr/local/bin/cmake -E cmake_link_script CMakeFiles/cmTC_bc241.dir/link.txt --verbose=1
/opt/rh/devtoolset-7/root/usr/bin/cc  -D_GNU_SOURCE    -Wl,-z,defs  CMakeFiles/cmTC_bc241.dir/CheckSymbolExists.c.o  -o cmTC_bc241 
gmake[1]: Leaving directory '/home/centos/smoketest/PR-14916/build/CMakeFiles/CMakeTmp'

File /home/centos/smoketest/PR-14916/build/CMakeFiles/CMakeTmp/CheckSymbolExists.c:
/* */
#include 

int main(int argc, char** argv)
{
  (void)argv;
#ifndef GRND_NONBLOCK
  return ((int*)(&GRND_NONBLOCK))[argc];
#else
  (void)argc;
  return 0;
#endif
}

Determining if the timerfd_create exist passed with the following output:
Change Dir: /home/centos/smoketest/PR-14916/build/CMakeFiles/CMakeTmp

Run Build Command:"/opt/rh/devtoolset-7/root/usr/bin/gmake" "cmTC_8b690/fast"
/opt/rh/devtoolset-7/root/usr/bin/gmake -f CMakeFiles/cmTC_8b690.dir/build.make CMakeFiles/cmTC_8b690.dir/build
gmake[1]: Entering directory '/home/centos/smoketest/PR-14916/build/CMakeFiles/CMakeTmp'
Building C object CMakeFiles/cmTC_8b690.dir/CheckSymbolExists.c.o
/opt/rh/devtoolset-7/root/usr/bin/cc   -D_GNU_SOURCE    -o CMakeFiles/cmTC_8b690.dir/CheckSymbolExists.c.o   -c /home/centos/smoketest/PR-14916/build/CMakeFiles/CMakeTmp/CheckSymbolExists.c
Linking C executable cmTC_8b690
/usr/local/bin/cmake -E cmake_link_script CMakeFiles/cmTC_8b690.dir/link.txt --verbose=1
/opt/rh/devtoolset-7/root/usr/bin/cc  -D_GNU_SOURCE    -Wl,-z,defs  CMakeFiles/cmTC_8b690.dir/CheckSymbolExists.c.o  -o cmTC_8b690 
gmake[1]: Leaving directory '/home/centos/smoketest/PR-14916/build/CMakeFiles/CMakeTmp'

File /home/centos/smoketest/PR-14916/build/CMakeFiles/CMakeTmp/CheckSymbolExists.c:
/* */
#include 

int main(int argc, char** argv)
{
  (void)argv;
#ifndef timerfd_create
  return ((int*)(&timerfd_create))[argc];
#else
  (void)argc;
  return 0;
#endif
}

Determining if the sigtimedwait exist passed with the following output:
Change Dir: /home/centos/smoketest/PR-14916/build/CMakeFiles/CMakeTmp

Run Build Command:"/opt/rh/devtoolset-7/root/usr/bin/gmake" "cmTC_e09cc/fast"
/opt/rh/devtoolset-7/root/usr/bin/gmake -f CMakeFiles/cmTC_e09cc.dir/build.make CMakeFiles/cmTC_e09cc.dir/build
gmake[1]: Entering directory '/home/centos/smoketest/PR-14916/build/CMakeFiles/CMakeTmp'
Building C object CMakeFiles/cmTC_e09cc.dir/CheckSymbolExists.c.o
/opt/rh/devtoolset-7/root/usr/bin/cc   -D_GNU_SOURCE    -o CMakeFiles/cmTC_e09cc.dir/CheckSymbolExists.c.o   -c /home/centos/smoketest/PR-14916/build/CMakeFiles/CMakeTmp/CheckSymbolExists.c
Linking C executable cmTC_e09cc
/usr/local/bin/cmake -E cmake_link_script CMakeFiles/cmTC_e09cc.dir/link.txt --verbose=1
/opt/rh/devtoolset-7/root/usr/bin/cc  -D_GNU_SOURCE    -Wl,-z,defs  CMakeFiles/cmTC_e09cc.dir/CheckSymbolExists.c.o  -o cmTC_e09cc 
gmake[1]: Leaving directory '/home/centos/smoketest/PR-14916/build/CMakeFiles/CMakeTmp'

File /home/centos/smoketest/PR-14916/build/CMakeFiles/CMakeTmp/CheckSymbolExists.c:
/* */
#include 

int main(int argc, char** argv)
{
  (void)argv;
#ifndef sigtimedwait
  return ((int*)(&sigtimedwait))[argc];
#else
  (void)argc;
  return 0;
#endif
}

Performing C++ SOURCE FILE Test HAVE_BUILTIN_BSWAP32 succeeded with the following output:
Change Dir: /home/centos/smoketest/PR-14916/build/CMakeFiles/CMakeTmp

Run Build Command:"/opt/rh/devtoolset-7/root/usr/bin/gmake" "cmTC_906da/fast"
/opt/rh/devtoolset-7/root/usr/bin/gmake -f CMakeFiles/cmTC_906da.dir/build.make CMakeFiles/cmTC_906da.dir/build
gmake[1]: Entering directory '/home/centos/smoketest/PR-14916/build/CMakeFiles/CMakeTmp'
Building CXX object CMakeFiles/cmTC_906da.dir/src.cxx.o
/opt/rh/devtoolset-7/root/usr/bin/c++    -frtti -fPIC -fmessage-length=0 -Werror=format -Wformat-security -Wformat-nonliteral -pthread -Wuninitialized -Werror=return-type -Werror=format-nonliteral -Wno-psabi -Wparentheses -std=c++11 -DHAVE_BUILTIN_BSWAP32   -o CMakeFiles/cmTC_906da.dir/src.cxx.o -c /home/centos/smoketest/PR-14916/build/CMakeFiles/CMakeTmp/src.cxx
Linking CXX executable cmTC_906da
/usr/local/bin/cmake -E cmake_link_script CMakeFiles/cmTC_906da.dir/link.txt --verbose=1
/opt/rh/devtoolset-7/root/usr/bin/c++   -frtti -fPIC -fmessage-length=0 -Werror=format -Wformat-security -Wformat-nonliteral -pthread -Wuninitialized -Werror=return-type -Werror=format-nonliteral -Wno-psabi -Wparentheses -std=c++11 -DHAVE_BUILTIN_BSWAP32    -rdynamic CMakeFiles/cmTC_906da.dir/src.cxx.o  -o cmTC_906da 
gmake[1]: Leaving directory '/home/centos/smoketest/PR-14916/build/CMakeFiles/CMakeTmp'

Source file was:
int main() { return __builtin_bswap32(42); }
Performing C++ SOURCE FILE Test HAVE_BUILTIN_BSWAP64 succeeded with the following output:
Change Dir: /home/centos/smoketest/PR-14916/build/CMakeFiles/CMakeTmp

Run Build Command:"/opt/rh/devtoolset-7/root/usr/bin/gmake" "cmTC_a004b/fast"
/opt/rh/devtoolset-7/root/usr/bin/gmake -f CMakeFiles/cmTC_a004b.dir/build.make CMakeFiles/cmTC_a004b.dir/build
gmake[1]: Entering directory '/home/centos/smoketest/PR-14916/build/CMakeFiles/CMakeTmp'
Building CXX object CMakeFiles/cmTC_a004b.dir/src.cxx.o
/opt/rh/devtoolset-7/root/usr/bin/c++    -frtti -fPIC -fmessage-length=0 -Werror=format -Wformat-security -Wformat-nonliteral -pthread -Wuninitialized -Werror=return-type -Werror=format-nonliteral -Wno-psabi -Wparentheses -std=c++11 -DHAVE_BUILTIN_BSWAP64   -o CMakeFiles/cmTC_a004b.dir/src.cxx.o -c /home/centos/smoketest/PR-14916/build/CMakeFiles/CMakeTmp/src.cxx
/home/centos/smoketest/PR-14916/build/CMakeFiles/CMakeTmp/src.cxx: In function ‘int main()’:
/home/centos/smoketest/PR-14916/build/CMakeFiles/CMakeTmp/src.cxx:1:38: warning: overflow in implicit constant conversion [-Woverflow]
 int main() { return __builtin_bswap64(42); }
                     ~~~~~~~~~~~~~~~~~^~~~
Linking CXX executable cmTC_a004b
/usr/local/bin/cmake -E cmake_link_script CMakeFiles/cmTC_a004b.dir/link.txt --verbose=1
/opt/rh/devtoolset-7/root/usr/bin/c++   -frtti -fPIC -fmessage-length=0 -Werror=format -Wformat-security -Wformat-nonliteral -pthread -Wuninitialized -Werror=return-type -Werror=format-nonliteral -Wno-psabi -Wparentheses -std=c++11 -DHAVE_BUILTIN_BSWAP64    -rdynamic CMakeFiles/cmTC_a004b.dir/src.cxx.o  -o cmTC_a004b 
gmake[1]: Leaving directory '/home/centos/smoketest/PR-14916/build/CMakeFiles/CMakeTmp'

Source file was:
int main() { return __builtin_bswap64(42); }
PR-14916  (Sha: 9a7b9750)

OS: centos 7.6.1810 (Linux 3.10.0-957.1.3.el7.x86_64)
 GCC:  gcc (GCC) 7.3.1 20180303 (Red Hat 7.3.1-5)
 Host: ip-10-20-0-239.ca-central-1.compute.internal
 Git:  git version 2.9.5

[Build error:](https://gist.github.com/a854e80b0be9e6174f07e9345e80b6e1)
Build log [Build log](https://gist.github.com/HPCCSmoketest/a854e80b0be9e6174f07e9345e80b6e1#file-result-21-05-04-08-46-20-log)
‘../utils.sh’ -> ‘./utils.sh’
‘../checkDiskSpace.sh’ -> ‘./checkDiskSpace.sh’
Sytem ID: CentOS_Linux_7
Archive previous test session logs and other files older than 2 minutes.
	zip warning: old-logs-2021-05-04_08-46-31.zip not found or empty
  adding: test.log (stored 0%)
  adding: 14916.diff (deflated 57%)
  adding: changedFiles.txt (stored 0%)
Stop hpcc to remove leftover admin stuff
HPCC doesn't run
Check if any hpcc owned orphan process is running
There is not leftover process
There is not HPCC package isntalled
There is not leftover /opt/HPCCSystems directory
Done.
BUILD_ROOT:build
HAVE_PKG: 0
SKIP_BUILD:0
./ProcessPullRequests.py
Cores: 16
CPU speed: 2499 MHz
CPU Bogo Mips:  5000
Parallel queries: 10
Build threads: 24
Total memory: 61 GB
Available memory: 60 GB
Memory core ratio: 3.812 GB/core
Setup timeout: 120 sec
Regression timeout: 720 sec
Start...
PR_ROOT:/home/centos/smoketest/PR-14916
Build type: RelWithDebInfo
-tests="*.ecl " -docs=False -unittest=True -wuttest=True -buildEclWatch=False -keepFiles=False -enableStackTrace=True -newEclWatchBuildMode=True
./build.sh CLI params are: -tests="*.ecl " -docs=False -unittest=True -wuttest=True -buildEclWatch=False -keepFiles=False -enableStackTrace=True -newEclWatchBuildMode=True
Param: tests="*.ecl "
Regression Suite test case(s): '*.ecl '
Param: docs=False
Build docs: '0'
Param: unittest=True
Run unittests: '1'
Param: wuttest=True
Run wutool -selftest: '1'
Param: buildEclWatch=False
Build ECLWatch: 'IF_MISSING'
Build wsSQL: '1'
Param: keepFiles=False
Keep files: '0'
Param: enableStackTrace=True
Stack trace: '1', ENABLE_STACK_TRACE: --generateStackTrace
Param: newEclWatchBuildMode=True
New ECLWatch build mode:1
Loglevel: info
line in suite: '.
excludeInclude: 0 (path: /home/centos/smoketest/PR-14916/HPCC-Platform/testing/regress/hpcc/regression/suite.py)
Regression Suite test case(s): '*.ecl '
Global exclusion: --ef pipefail.ecl -e=embedded,3rdparty,python2
Current branch: hpcc-25829-std-datapatterns-bestrecordstructure-smoketest
Cloning OBT into /home/centos/smoketest/PR-14916/OBT...
~/smoketest/PR-14916 ~/smoketest/PR-14916
~/smoketest/PR-14916
Done.
Forceing standard core to be generated in same directory
res:core_%e.%p
Current core generation is: core_%e.%p
Patch system/jlib/jthread.hpp to build in c++11 
Milestone:Makefile generation
RelWithDebInfo build start at: 2021-05-04_08-46-32
There is not 'build/downloads/boost_1_71_0.tar.gz' file.
res: ‘/home/centos/boost_1_71_0.tar.gz’ -> ‘build/downloads/boost_1_71_0.tar.gz’
-rwxrw-rw-. 1 centos centos 118520935 May  4 08:46 build/downloads/boost_1_71_0.tar.gz
Create makefiles 2021-05-04_08-46-33
CMAKE_CMD:'cmake -G "Eclipse CDT4 - Unix Makefiles" -D CMAKE_BUILD_TYPE=RelWithDebInfo -D INCLUDE_PLUGINS=ON -D TEST_PLUGINS=1 -DSUPPRESS_PY2EMBED=ON -DINCLUDE_PY2EMBED=OFF -D MAKE_DOCS=0 -D USE_CPPUNIT=1 -D INCLUDE_SPARK=0 -DSUPPRESS_SPARK=1 -DSPARK=0 -D ECLWATCH_BUILD_STRATEGY=IF_MISSING -D WSSQL_SERVICE=1 -D CMAKE_EXPORT_COMPILE_COMMANDS=ON -D USE_LIBXSLT=ON -D XALAN_LIBRARIES= -D MAKE_CASSANDRAEMBED=1 -DCENTOS_6_BOOST=ON -D CMAKE_ECLIPSE_MAKE_ARGUMENTS=-30 ../HPCC-Platform'

We keep the source and build files only
so, uninstall HPCC...
HPCC Uninstall: failed (Missing 'complete-uninstall.sh' file.)
Remove Cassandra leftovers.
To remove hpccsystems-platform* success
Makefiles created (2021-05-04_08-46-41 9 sec )
Keep ECLWatch build as is.
Milestone:Build it
cmd: make -j 24  (2021-05-04_08-46-41)
res: ‘/home/centos/boost_1_71_0.tar.gz’ -> ‘build/downloads/boost_1_71_0.tar.gz’
Error(s): 19
warn(226) A package without a profile could throw errors or warnings. package: dojo-util
warn(226) A package without a profile could throw errors or warnings. package: dojo-util
	errors: 0
CMake Error at /home/centos/smoketest/PR-14916/build/generate-boost-regex-prefix/src/generate-boost-regex-stamp/download-generate-boost-regex.cmake:159 (message):
    error: downloading 'https://dl.bintray.com/boostorg/release/1.71.0/source/boost_1_71_0.tar.gz' failed
  The requested URL returned error: 403 Forbidden
         error: downloading 'https://dl.bintray.com/boostorg/release/1.71.0/source/boost_1_71_0.tar.gz' failed
  The requested URL returned error: 403 Forbidden
         error: downloading 'https://dl.bintray.com/boostorg/release/1.71.0/source/boost_1_71_0.tar.gz' failed
  The requested URL returned error: 403 Forbidden
         error: downloading 'https://dl.bintray.com/boostorg/release/1.71.0/source/boost_1_71_0.tar.gz' failed
  The requested URL returned error: 403 Forbidden
         error: downloading 'https://dl.bintray.com/boostorg/release/1.71.0/source/boost_1_71_0.tar.gz' failed
  The requested URL returned error: 403 Forbidden
         error: downloading 'https://dl.bintray.com/boostorg/release/1.71.0/source/boost_1_71_0.tar.gz' failed
  The requested URL returned error: 403 Forbidden
make[2]: *** [CMakeFiles/generate-boost-regex.dir/build.make:90: generate-boost-regex-prefix/src/generate-boost-regex-stamp/generate-boost-regex-download] Error 1
make[1]: *** [CMakeFiles/Makefile2:937: CMakeFiles/generate-boost-regex.dir/all] Error 2
make: *** [Makefile:163: all] Error 2
CMake Error at /home/centos/smoketest/PR-14916/build/generate-boost-regex-prefix/src/generate-boost-regex-stamp/download-generate-boost-regex.cmake:159 (message):
  Each download failed!
    error: downloading 'https://dl.bintray.com/boostorg/release/1.71.0/source/boost_1_71_0.tar.gz' failed
         status_code: 22
         status_string: "HTTP response code said error"
         log:
         --- LOG BEGIN ---
           Trying 52.42.240.241...
  TCP_NODELAY set
  Connected to dl.bintray.com (52.42.240.241) port 443 (#0)
  ALPN, offering http/1.1
  successfully set certificate verify locations:
    CAfile: /etc/pki/tls/certs/ca-bundle.crt
    CApath: none
  [5 bytes data]
  TLSv1.3 (OUT), TLS handshake, Client hello (1):
  [512 bytes data]
  [5 bytes data]
  TLSv1.3 (IN), TLS handshake, Server hello (2):
  [102 bytes data]
  NPN, negotiated HTTP1.1
  [5 bytes data]
  TLSv1.2 (IN), TLS handshake, Certificate (11):
  [2765 bytes data]
  [5 bytes data]
  TLSv1.2 (IN), TLS handshake, Server key exchange (12):
  [333 bytes data]
  [5 bytes data]
  TLSv1.2 (IN), TLS handshake, Server finished (14):
  [4 bytes data]
  [5 bytes data]
  TLSv1.2 (OUT), TLS handshake, Client key exchange (16):
  [70 bytes data]
  [5 bytes data]
  TLSv1.2 (OUT), TLS change cipher, Change cipher spec (1):
  [1 bytes data]
  [5 bytes data]
  TLSv1.2 (OUT), TLS handshake, Next protocol (67):
  [36 bytes data]
  [5 bytes data]
  TLSv1.2 (OUT), TLS handshake, Finished (20):
  [16 bytes data]
  [5 bytes data]
  [5 bytes data]
  TLSv1.2 (IN), TLS handshake, Finished (20):
  [16 bytes data]
  SSL connection using TLSv1.2 / ECDHE-RSA-AES128-GCM-SHA256
  ALPN, server did not agree to a protocol
  Server certificate:
   subject: CN=*.bintray.com
   start date: Sep 26 00:00:00 2019 GMT
   expire date: Nov  9 12:00:00 2021 GMT
   subjectAltName: host "dl.bintray.com" matched cert's "*.bintray.com"
   issuer: C=US; O=DigiCert Inc; OU=www.digicert.com; CN=GeoTrust RSA CA 2018
   SSL certificate verify ok.
  [5 bytes data]
  GET /boostorg/release/1.71.0/source/boost_1_71_0.tar.gz HTTP/1.1
  Host: dl.bintray.com
  User-Agent: curl/7.62.0
  Accept: */*
  
  [5 bytes data]
  The requested URL returned error: 403 Forbidden
  Closing connection 0
  [5 bytes data]
  TLSv1.2 (OUT), TLS alert, close notify (256):
  [2 bytes data]
  
         --- LOG END ---
         error: downloading 'https://dl.bintray.com/boostorg/release/1.71.0/source/boost_1_71_0.tar.gz' failed
         status_code: 22
         status_string: "HTTP response code said error"
         log:
         --- LOG BEGIN ---
           Trying 34.217.158.44...
  TCP_NODELAY set
  Connected to dl.bintray.com (34.217.158.44) port 443 (#0)
  ALPN, offering http/1.1
  successfully set certificate verify locations:
    CAfile: /etc/pki/tls/certs/ca-bundle.crt
    CApath: none
  [5 bytes data]
  TLSv1.3 (OUT), TLS handshake, Client hello (1):
  [512 bytes data]
  [5 bytes data]
  TLSv1.3 (IN), TLS handshake, Server hello (2):
  [102 bytes data]
  NPN, negotiated HTTP1.1
  [5 bytes data]
  TLSv1.2 (IN), TLS handshake, Certificate (11):
  [2765 bytes data]
  [5 bytes data]
  TLSv1.2 (IN), TLS handshake, Server key exchange (12):
  [333 bytes data]
  [5 bytes data]
  TLSv1.2 (IN), TLS handshake, Server finished (14):
  [4 bytes data]
  [5 bytes data]
  TLSv1.2 (OUT), TLS handshake, Client key exchange (16):
  [70 bytes data]
  [5 bytes data]
  TLSv1.2 (OUT), TLS change cipher, Change cipher spec (1):
  [1 bytes data]
  [5 bytes data]
  TLSv1.2 (OUT), TLS handshake, Next protocol (67):
  [36 bytes data]
  [5 bytes data]
  TLSv1.2 (OUT), TLS handshake, Finished (20):
  [16 bytes data]
  [5 bytes data]
  [5 bytes data]
  TLSv1.2 (IN), TLS handshake, Finished (20):
  [16 bytes data]
  SSL connection using TLSv1.2 / ECDHE-RSA-AES128-GCM-SHA256
  ALPN, server did not agree to a protocol
  Server certificate:
   subject: CN=*.bintray.com
   start date: Sep 26 00:00:00 2019 GMT
   expire date: Nov  9 12:00:00 2021 GMT
   subjectAltName: host "dl.bintray.com" matched cert's "*.bintray.com"
   issuer: C=US; O=DigiCert Inc; OU=www.digicert.com; CN=GeoTrust RSA CA 2018
   SSL certificate verify ok.
  [5 bytes data]
  GET /boostorg/release/1.71.0/source/boost_1_71_0.tar.gz HTTP/1.1
  Host: dl.bintray.com
  User-Agent: curl/7.62.0
  Accept: */*
  
  [5 bytes data]
  The requested URL returned error: 403 Forbidden
  Closing connection 0
  [5 bytes data]
  TLSv1.2 (OUT), TLS alert, close notify (256):
  [2 bytes data]
  
         --- LOG END ---
         error: downloading 'https://dl.bintray.com/boostorg/release/1.71.0/source/boost_1_71_0.tar.gz' failed
         status_code: 22
         status_string: "HTTP response code said error"
         log:
         --- LOG BEGIN ---
           Trying 52.42.240.241...
  TCP_NODELAY set
  Connected to dl.bintray.com (52.42.240.241) port 443 (#0)
  ALPN, offering http/1.1
  successfully set certificate verify locations:
    CAfile: /etc/pki/tls/certs/ca-bundle.crt
    CApath: none
  [5 bytes data]
  TLSv1.3 (OUT), TLS handshake, Client hello (1):
  [512 bytes data]
  [5 bytes data]
  TLSv1.3 (IN), TLS handshake, Server hello (2):
  [102 bytes data]
  NPN, negotiated HTTP1.1
  [5 bytes data]
  TLSv1.2 (IN), TLS handshake, Certificate (11):
  [2765 bytes data]
  [5 bytes data]
  TLSv1.2 (IN), TLS handshake, Server key exchange (12):
  [333 bytes data]
  [5 bytes data]
  TLSv1.2 (IN), TLS handshake, Server finished (14):
  [4 bytes data]
  [5 bytes data]
  TLSv1.2 (OUT), TLS handshake, Client key exchange (16):
  [70 bytes data]
  [5 bytes data]
  TLSv1.2 (OUT), TLS change cipher, Change cipher spec (1):
  [1 bytes data]
  [5 bytes data]
  TLSv1.2 (OUT), TLS handshake, Next protocol (67):
  [36 bytes data]
  [5 bytes data]
  TLSv1.2 (OUT), TLS handshake, Finished (20):
  [16 bytes data]
  [5 bytes data]
  [5 bytes data]
  TLSv1.2 (IN), TLS handshake, Finished (20):
  [16 bytes data]
  SSL connection using TLSv1.2 / ECDHE-RSA-AES128-GCM-SHA256
  ALPN, server did not agree to a protocol
  Server certificate:
   subject: CN=*.bintray.com
   start date: Sep 26 00:00:00 2019 GMT
   expire date: Nov  9 12:00:00 2021 GMT
   subjectAltName: host "dl.bintray.com" matched cert's "*.bintray.com"
   issuer: C=US; O=DigiCert Inc; OU=www.digicert.com; CN=GeoTrust RSA CA 2018
   SSL certificate verify ok.
  [5 bytes data]
  GET /boostorg/release/1.71.0/source/boost_1_71_0.tar.gz HTTP/1.1
  Host: dl.bintray.com
  User-Agent: curl/7.62.0
  Accept: */*
  
  [5 bytes data]
  The requested URL returned error: 403 Forbidden
  Closing connection 0
  [5 bytes data]
  TLSv1.2 (OUT), TLS alert, close notify (256):
  [2 bytes data]
  
         --- LOG END ---
         error: downloading 'https://dl.bintray.com/boostorg/release/1.71.0/source/boost_1_71_0.tar.gz' failed
         status_code: 22
         status_string: "HTTP response code said error"
         log:
         --- LOG BEGIN ---
           Trying 34.223.179.172...
  TCP_NODELAY set
  Connected to dl.bintray.com (34.223.179.172) port 443 (#0)
  ALPN, offering http/1.1
  successfully set certificate verify locations:
    CAfile: /etc/pki/tls/certs/ca-bundle.crt
    CApath: none
  [5 bytes data]
  TLSv1.3 (OUT), TLS handshake, Client hello (1):
  [512 bytes data]
  [5 bytes data]
  TLSv1.3 (IN), TLS handshake, Server hello (2):
  [102 bytes data]
  NPN, negotiated HTTP1.1
  [5 bytes data]
  TLSv1.2 (IN), TLS handshake, Certificate (11):
  [2765 bytes data]
  [5 bytes data]
  TLSv1.2 (IN), TLS handshake, Server key exchange (12):
  [333 bytes data]
  [5 bytes data]
  TLSv1.2 (IN), TLS handshake, Server finished (14):
  [4 bytes data]
  [5 bytes data]
  TLSv1.2 (OUT), TLS handshake, Client key exchange (16):
  [70 bytes data]
  [5 bytes data]
  TLSv1.2 (OUT), TLS change cipher, Change cipher spec (1):
  [1 bytes data]
  [5 bytes data]
  TLSv1.2 (OUT), TLS handshake, Next protocol (67):
  [36 bytes data]
  [5 bytes data]
  TLSv1.2 (OUT), TLS handshake, Finished (20):
  [16 bytes data]
  [5 bytes data]
  [5 bytes data]
  TLSv1.2 (IN), TLS handshake, Finished (20):
  [16 bytes data]
  SSL connection using TLSv1.2 / ECDHE-RSA-AES128-GCM-SHA256
  ALPN, server did not agree to a protocol
  Server certificate:
   subject: CN=*.bintray.com
   start date: Sep 26 00:00:00 2019 GMT
   expire date: Nov  9 12:00:00 2021 GMT
   subjectAltName: host "dl.bintray.com" matched cert's "*.bintray.com"
   issuer: C=US; O=DigiCert Inc; OU=www.digicert.com; CN=GeoTrust RSA CA 2018
   SSL certificate verify ok.
  [5 bytes data]
  GET /boostorg/release/1.71.0/source/boost_1_71_0.tar.gz HTTP/1.1
  Host: dl.bintray.com
  User-Agent: curl/7.62.0
  Accept: */*
  
  [5 bytes data]
  The requested URL returned error: 403 Forbidden
  Closing connection 0
  [5 bytes data]
  TLSv1.2 (OUT), TLS alert, close notify (256):
  [2 bytes data]
  
         --- LOG END ---
         error: downloading 'https://dl.bintray.com/boostorg/release/1.71.0/source/boost_1_71_0.tar.gz' failed
         status_code: 22
         status_string: "HTTP response code said error"
         log:
         --- LOG BEGIN ---
           Trying 34.214.237.80...
  TCP_NODELAY set
  Connected to dl.bintray.com (34.214.237.80) port 443 (#0)
  ALPN, offering http/1.1
  successfully set certificate verify locations:
    CAfile: /etc/pki/tls/certs/ca-bundle.crt
    CApath: none
  [5 bytes data]
  TLSv1.3 (OUT), TLS handshake, Client hello (1):
  [512 bytes data]
  [5 bytes data]
  TLSv1.3 (IN), TLS handshake, Server hello (2):
  [102 bytes data]
  NPN, negotiated HTTP1.1
  [5 bytes data]
  TLSv1.2 (IN), TLS handshake, Certificate (11):
  [2765 bytes data]
  [5 bytes data]
  TLSv1.2 (IN), TLS handshake, Server key exchange (12):
  [333 bytes data]
  [5 bytes data]
  TLSv1.2 (IN), TLS handshake, Server finished (14):
  [4 bytes data]
  [5 bytes data]
  TLSv1.2 (OUT), TLS handshake, Client key exchange (16):
  [70 bytes data]
  [5 bytes data]
  TLSv1.2 (OUT), TLS change cipher, Change cipher spec (1):
  [1 bytes data]
  [5 bytes data]
  TLSv1.2 (OUT), TLS handshake, Next protocol (67):
  [36 bytes data]
  [5 bytes data]
  TLSv1.2 (OUT), TLS handshake, Finished (20):
  [16 bytes data]
  [5 bytes data]
  [5 bytes data]
  TLSv1.2 (IN), TLS handshake, Finished (20):
  [16 bytes data]
  SSL connection using TLSv1.2 / ECDHE-RSA-AES128-GCM-SHA256
  ALPN, server did not agree to a protocol
  Server certificate:
   subject: CN=*.bintray.com
   start date: Sep 26 00:00:00 2019 GMT
   expire date: Nov  9 12:00:00 2021 GMT
   subjectAltName: host "dl.bintray.com" matched cert's "*.bintray.com"
   issuer: C=US; O=DigiCert Inc; OU=www.digicert.com; CN=GeoTrust RSA CA 2018
   SSL certificate verify ok.
  [5 bytes data]
  GET /boostorg/release/1.71.0/source/boost_1_71_0.tar.gz HTTP/1.1
  Host: dl.bintray.com
  User-Agent: curl/7.62.0
  Accept: */*
  
  [5 bytes data]
  The requested URL returned error: 403 Forbidden
  Closing connection 0
  [5 bytes data]
  TLSv1.2 (OUT), TLS alert, close notify (256):
  [2 bytes data]
  
         --- LOG END ---
         error: downloading 'https://dl.bintray.com/boostorg/release/1.71.0/source/boost_1_71_0.tar.gz' failed
         status_code: 22
         status_string: "HTTP response code said error"
         log:
         --- LOG BEGIN ---
           Trying 34.215.63.224...
  TCP_NODELAY set
  Connected to dl.bintray.com (34.215.63.224) port 443 (#0)
  ALPN, offering http/1.1
  successfully set certificate verify locations:
    CAfile: /etc/pki/tls/certs/ca-bundle.crt
    CApath: none
  [5 bytes data]
  TLSv1.3 (OUT), TLS handshake, Client hello (1):
  [512 bytes data]
  [5 bytes data]
  TLSv1.3 (IN), TLS handshake, Server hello (2):
  [102 bytes data]
  NPN, negotiated HTTP1.1
  [5 bytes data]
  TLSv1.2 (IN), TLS handshake, Certificate (11):
  [2765 bytes data]
  [5 bytes data]
  TLSv1.2 (IN), TLS handshake, Server key exchange (12):
  [333 bytes data]
  [5 bytes data]
  TLSv1.2 (IN), TLS handshake, Server finished (14):
  [4 bytes data]
  [5 bytes data]
  TLSv1.2 (OUT), TLS handshake, Client key exchange (16):
  [70 bytes data]
  [5 bytes data]
  TLSv1.2 (OUT), TLS change cipher, Change cipher spec (1):
  [1 bytes data]
  [5 bytes data]
  TLSv1.2 (OUT), TLS handshake, Next protocol (67):
  [36 bytes data]
  [5 bytes data]
  TLSv1.2 (OUT), TLS handshake, Finished (20):
  [16 bytes data]
  [5 bytes data]
  [5 bytes data]
  TLSv1.2 (IN), TLS handshake, Finished (20):
  [16 bytes data]
  SSL connection using TLSv1.2 / ECDHE-RSA-AES128-GCM-SHA256
  ALPN, server did not agree to a protocol
  Server certificate:
   subject: CN=*.bintray.com
   start date: Sep 26 00:00:00 2019 GMT
   expire date: Nov  9 12:00:00 2021 GMT
   subjectAltName: host "dl.bintray.com" matched cert's "*.bintray.com"
   issuer: C=US; O=DigiCert Inc; OU=www.digicert.com; CN=GeoTrust RSA CA 2018
   SSL certificate verify ok.
  [5 bytes data]
  GET /boostorg/release/1.71.0/source/boost_1_71_0.tar.gz HTTP/1.1
  Host: dl.bintray.com
  User-Agent: curl/7.62.0
  Accept: */*
  
  [5 bytes data]
  The requested URL returned error: 403 Forbidden
  Closing connection 0
  [5 bytes data]
  TLSv1.2 (OUT), TLS alert, close notify (256):
  [2 bytes data]
  
         --- LOG END ---
         
    
make[2]: *** [CMakeFiles/generate-boost-regex.dir/build.make:90: generate-boost-regex-prefix/src/generate-boost-regex-stamp/generate-boost-regex-download] Error 1
make[1]: *** [CMakeFiles/Makefile2:937: CMakeFiles/generate-boost-regex.dir/all] Error 2
make[1]: *** Waiting for unfinished jobs....
[  0%] Building CXX object aws-cpp-sdk-core/CMakeFiles/aws-cpp-sdk-core.dir/source/AmazonStreamingWebServiceRequest.cpp.o
[  0%] Building CXX object aws-cpp-sdk-core/CMakeFiles/aws-cpp-sdk-core.dir/source/AmazonWebServiceRequest.cpp.o
[  0%] Building CXX object aws-cpp-sdk-core/CMakeFiles/aws-cpp-sdk-core.dir/source/Aws.cpp.o
[  0%] Building CXX object aws-cpp-sdk-core/CMakeFiles/aws-cpp-sdk-core.dir/source/Globals.cpp.o
[  0%] Building CXX object aws-cpp-sdk-core/CMakeFiles/aws-cpp-sdk-core.dir/source/Version.cpp.o
[  0%] Building CXX object aws-cpp-sdk-core/CMakeFiles/aws-cpp-sdk-core.dir/source/auth/AWSAuthSigner.cpp.o
[  0%] Building CXX object aws-cpp-sdk-core/CMakeFiles/aws-cpp-sdk-core.dir/source/auth/AWSAuthSignerProvider.cpp.o
[  0%] Building CXX object aws-cpp-sdk-core/CMakeFiles/aws-cpp-sdk-core.dir/source/auth/AWSCredentialsProvider.cpp.o
[  0%] Building CXX object aws-cpp-sdk-core/CMakeFiles/aws-cpp-sdk-core.dir/source/auth/AWSCredentialsProviderChain.cpp.o
[  0%] Building CXX object aws-cpp-sdk-core/CMakeFiles/aws-cpp-sdk-core.dir/source/auth/STSCredentialsProvider.cpp.o
[  0%] Building CXX object aws-cpp-sdk-core/CMakeFiles/aws-cpp-sdk-core.dir/source/client/AWSClient.cpp.o
[  0%] Building CXX object aws-cpp-sdk-core/CMakeFiles/aws-cpp-sdk-core.dir/source/client/AWSErrorMarshaller.cpp.o
[  0%] Building CXX object aws-cpp-sdk-core/CMakeFiles/aws-cpp-sdk-core.dir/source/client/AsyncCallerContext.cpp.o
[  0%] Building CXX object aws-cpp-sdk-core/CMakeFiles/aws-cpp-sdk-core.dir/source/client/ClientConfiguration.cpp.o
[  0%] Building CXX object aws-cpp-sdk-core/CMakeFiles/aws-cpp-sdk-core.dir/source/client/CoreErrors.cpp.o
[  0%] Building CXX object aws-cpp-sdk-core/CMakeFiles/aws-cpp-sdk-core.dir/source/client/DefaultRetryStrategy.cpp.o
[  0%] Building CXX object aws-cpp-sdk-core/CMakeFiles/aws-cpp-sdk-core.dir/source/client/SpecifiedRetryableErrorsRetryStrategy.cpp.o
[  0%] Building CXX object aws-cpp-sdk-core/CMakeFiles/aws-cpp-sdk-core.dir/source/config/AWSProfileConfigLoader.cpp.o
[  0%] Building CXX object aws-cpp-sdk-core/CMakeFiles/aws-cpp-sdk-core.dir/source/external/cjson/cJSON.cpp.o
[  0%] Building CXX object aws-cpp-sdk-core/CMakeFiles/aws-cpp-sdk-core.dir/source/external/tinyxml2/tinyxml2.cpp.o
[  0%] Building CXX object aws-cpp-sdk-core/CMakeFiles/aws-cpp-sdk-core.dir/source/http/HttpClient.cpp.o
[  0%] Building CXX object aws-cpp-sdk-core/CMakeFiles/aws-cpp-sdk-core.dir/source/http/HttpClientFactory.cpp.o
[  0%] Building CXX object aws-cpp-sdk-core/CMakeFiles/aws-cpp-sdk-core.dir/source/http/HttpRequest.cpp.o
[  0%] Building CXX object aws-cpp-sdk-core/CMakeFiles/aws-cpp-sdk-core.dir/source/http/HttpTypes.cpp.o
[  0%] Building CXX object aws-cpp-sdk-core/CMakeFiles/aws-cpp-sdk-core.dir/source/http/Scheme.cpp.o
[  0%] Building CXX object aws-cpp-sdk-core/CMakeFiles/aws-cpp-sdk-core.dir/source/http/URI.cpp.o
[  0%] Building CXX object aws-cpp-sdk-core/CMakeFiles/aws-cpp-sdk-core.dir/source/http/curl/CurlHandleContainer.cpp.o
[  0%] Building CXX object aws-cpp-sdk-core/CMakeFiles/aws-cpp-sdk-core.dir/source/http/curl/CurlHttpClient.cpp.o
[  0%] Building CXX object aws-cpp-sdk-core/CMakeFiles/aws-cpp-sdk-core.dir/source/http/standard/StandardHttpRequest.cpp.o
[  0%] Building CXX object aws-cpp-sdk-core/CMakeFiles/aws-cpp-sdk-core.dir/source/http/standard/StandardHttpResponse.cpp.o
[  0%] Building CXX object aws-cpp-sdk-core/CMakeFiles/aws-cpp-sdk-core.dir/source/internal/AWSHttpResourceClient.cpp.o
[  0%] Building CXX object aws-cpp-sdk-core/CMakeFiles/aws-cpp-sdk-core.dir/source/monitoring/DefaultMonitoring.cpp.o
[  0%] Building CXX object aws-cpp-sdk-core/CMakeFiles/aws-cpp-sdk-core.dir/source/monitoring/HttpClientMetrics.cpp.o
[  0%] Building CXX object aws-cpp-sdk-core/CMakeFiles/aws-cpp-sdk-core.dir/source/monitoring/MonitoringManager.cpp.o
[  0%] Building CXX object aws-cpp-sdk-core/CMakeFiles/aws-cpp-sdk-core.dir/source/net/linux-shared/Net.cpp.o
[  0%] Building CXX object aws-cpp-sdk-core/CMakeFiles/aws-cpp-sdk-core.dir/source/net/linux-shared/SimpleUDP.cpp.o
[  0%] Building CXX object aws-cpp-sdk-core/CMakeFiles/aws-cpp-sdk-core.dir/source/platform/linux-shared/Environment.cpp.o
[  0%] Building CXX object aws-cpp-sdk-core/CMakeFiles/aws-cpp-sdk-core.dir/source/platform/linux-shared/FileSystem.cpp.o
[  0%] Building CXX object aws-cpp-sdk-core/CMakeFiles/aws-cpp-sdk-core.dir/source/platform/linux-shared/OSVersionInfo.cpp.o
[  0%] Building CXX object aws-cpp-sdk-core/CMakeFiles/aws-cpp-sdk-core.dir/source/platform/linux-shared/Security.cpp.o
[  0%] Building CXX object aws-cpp-sdk-core/CMakeFiles/aws-cpp-sdk-core.dir/source/platform/linux-shared/Time.cpp.o
[  0%] Building CXX object aws-cpp-sdk-core/CMakeFiles/aws-cpp-sdk-core.dir/source/utils/Array.cpp.o
[  0%] Building CXX object aws-cpp-sdk-core/CMakeFiles/aws-cpp-sdk-core.dir/source/utils/DNS.cpp.o
[  0%] Building CXX object aws-cpp-sdk-core/CMakeFiles/aws-cpp-sdk-core.dir/source/utils/DateTimeCommon.cpp.o
Hash: ef418a41326df72203d1
Version: webpack 4.46.0
Time: 72225ms
Built at: 05/04/2021 8:48:50 AM
                    Asset      Size                                                                                                 Chunks                    Chunk Names
            0.eclwatch.js    11 KiB                                                                                                      0  [emitted]         
            1.eclwatch.js  10.4 KiB                                                                                                      1  [emitted]         
           10.eclwatch.js  68.6 KiB                                                                                                     10  [emitted]         
          100.eclwatch.js  14.9 KiB                                                                                      100, 14, 101, 108  [emitted]         
          101.eclwatch.js  14.9 KiB                                                                                      101, 14, 100, 108  [emitted]         
          102.eclwatch.js  21.3 KiB                                                                                                    102  [emitted]         
          103.eclwatch.js   677 KiB                                                                                                    103  [emitted]  [big]  
          104.eclwatch.js    45 KiB                                                                                                    104  [emitted]         
          105.eclwatch.js  22.2 KiB                                                                                                    105  [emitted]         
          106.eclwatch.js  22.1 KiB                                                                                                    106  [emitted]         
          107.eclwatch.js  22.5 KiB                                                                                               107, 157  [emitted]         
          108.eclwatch.js  13.2 KiB                                                                                                    108  [emitted]         
          109.eclwatch.js  15.1 KiB                                                                                                    109  [emitted]         
           11.eclwatch.js  1.89 MiB                       11, 8, 10, 15, 20, 21, 99, 110, 111, 112, 113, 114, 133, 134, 135, 136, 137, 157  [emitted]  [big]  
          110.eclwatch.js  14.2 KiB                                                   110, 15, 111, 112, 113, 114, 133, 134, 135, 136, 137  [emitted]         
          111.eclwatch.js  14.2 KiB                                                   111, 15, 110, 112, 113, 114, 133, 134, 135, 136, 137  [emitted]         
          112.eclwatch.js  14.2 KiB                                                   112, 15, 110, 111, 113, 114, 133, 134, 135, 136, 137  [emitted]         
          113.eclwatch.js  14.2 KiB                                                   113, 15, 110, 111, 112, 114, 133, 134, 135, 136, 137  [emitted]         
          114.eclwatch.js  14.2 KiB                                                   114, 15, 110, 111, 112, 113, 133, 134, 135, 136, 137  [emitted]         
          115.eclwatch.js  14.7 KiB                                                                                                    115  [emitted]         
          116.eclwatch.js  34.8 KiB                                                                                                    116  [emitted]         
          117.eclwatch.js  18.8 KiB                                                                                               117, 157  [emitted]         
          118.eclwatch.js  19.3 KiB                                                                                                    118  [emitted]         
          119.eclwatch.js  19.4 KiB                                                                                               119, 157  [emitted]         
           12.eclwatch.js  26.6 KiB                                                                                                     12  [emitted]         
          120.eclwatch.js  19.9 KiB                                                                                                    120  [emitted]         
          121.eclwatch.js    14 KiB                                                                                                    121  [emitted]         
          122.eclwatch.js  17.6 KiB                                                                                                    122  [emitted]         
          123.eclwatch.js  15.7 KiB                                                                                                    123  [emitted]         
          124.eclwatch.js  15.6 KiB                                                                                                    124  [emitted]         
          125.eclwatch.js  15.4 KiB                                                                                                    125  [emitted]         
          126.eclwatch.js  37.2 KiB                                                                                                    126  [emitted]         
          127.eclwatch.js  38.5 KiB                                                                                               127, 141  [emitted]         
          128.eclwatch.js  14.6 KiB                                                                                               128, 157  [emitted]         
          129.eclwatch.js  15.3 KiB                                                                                               129, 157  [emitted]         
           13.eclwatch.js  89.3 KiB                                                                                            13, 10, 157  [emitted]         
          130.eclwatch.js  14.8 KiB                                                                                               130, 157  [emitted]         
          131.eclwatch.js  14.7 KiB                                                                                               131, 157  [emitted]         
          132.eclwatch.js  32.8 KiB                                                                                               132, 157  [emitted]         
          133.eclwatch.js  12.5 KiB                                                                                133, 134, 135, 136, 137  [emitted]         
          134.eclwatch.js  12.5 KiB                                                                                134, 133, 135, 136, 137  [emitted]         
          135.eclwatch.js  12.5 KiB                                                                                135, 133, 134, 136, 137  [emitted]         
          136.eclwatch.js  12.5 KiB                                                                                136, 133, 134, 135, 137  [emitted]         
          137.eclwatch.js  12.5 KiB                                                                                137, 133, 134, 135, 136  [emitted]         
          138.eclwatch.js  21.8 KiB                                                                                                    138  [emitted]         
          139.eclwatch.js  13.1 KiB                                                                                                    139  [emitted]         
           14.eclwatch.js  14.9 KiB                                                                                      14, 100, 101, 108  [emitted]         
          140.eclwatch.js  12.5 KiB                                                                                                    140  [emitted]         
          141.eclwatch.js  33.3 KiB                                                                                                    141  [emitted]         
          142.eclwatch.js  33.1 KiB                                                                                                    142  [emitted]         
          143.eclwatch.js  17.6 KiB                                                                                                    143  [emitted]         
          144.eclwatch.js  21.5 KiB                                                                                                    144  [emitted]         
          145.eclwatch.js  15.2 KiB                                                                                                    145  [emitted]         
          146.eclwatch.js  13.4 KiB                                                                                                    146  [emitted]         
          147.eclwatch.js  12.9 KiB                                                                                                    147  [emitted]         
          148.eclwatch.js  12.5 KiB                                                                                                    148  [emitted]         
          149.eclwatch.js   494 KiB                                                                                                    149  [emitted]  [big]  
           15.eclwatch.js  14.2 KiB                                                   15, 110, 111, 112, 113, 114, 133, 134, 135, 136, 137  [emitted]         
          150.eclwatch.js    11 KiB                                                                                                    150  [emitted]         
          151.eclwatch.js  4.89 KiB                                                                                                    151  [emitted]         
          152.eclwatch.js  7.69 KiB                                                                                                    152  [emitted]         
          153.eclwatch.js   6.8 KiB                                                                                                    153  [emitted]         
          154.eclwatch.js  6.81 KiB                                                                                                    154  [emitted]         
          155.eclwatch.js  5.59 KiB                                                                                                    155  [emitted]         
          156.eclwatch.js  1.77 KiB                                                                                                    156  [emitted]         
          157.eclwatch.js  2.49 KiB                                                                                                    157  [emitted]         
           16.eclwatch.js  15.7 KiB                                                                                                     16  [emitted]         
           17.eclwatch.js  48.1 KiB                                                                                                     17  [emitted]         
           18.eclwatch.js  15.7 KiB                                                                                                     18  [emitted]         
           19.eclwatch.js   592 KiB                                                                                                     19  [emitted]  [big]  
            2.eclwatch.js  52.1 KiB                                                                                                      2  [emitted]         
           20.eclwatch.js   420 KiB                                                                                                     20  [emitted]  [big]  
           21.eclwatch.js   208 KiB                                                                                                     21  [emitted]         
           24.eclwatch.js  1.22 MiB                                                24, 4, 17, 18, 21, 72, 97, 102, 108, 109, 115, 147, 157  [emitted]  [big]  
           25.eclwatch.js  1.21 MiB                                       25, 4, 9, 17, 18, 21, 72, 108, 109, 133, 134, 135, 136, 137, 157  [emitted]  [big]  
           26.eclwatch.js  1.76 MiB              26, 4, 5, 7, 8, 9, 10, 16, 17, 18, 20, 21, 40, 97, 108, 109, 133, 134, 135, 136, 137, 147  [emitted]  [big]  
           27.eclwatch.js  1.42 MiB            27, 4, 7, 10, 17, 18, 21, 28, 30, 97, 102, 108, 109, 115, 133, 134, 135, 136, 137, 152, 157  [emitted]  [big]  
           28.eclwatch.js  1.37 MiB                     28, 4, 7, 10, 17, 18, 21, 30, 97, 102, 108, 109, 115, 133, 134, 135, 136, 137, 152  [emitted]  [big]  
           29.eclwatch.js  1.23 MiB  29, 7, 10, 14, 15, 21, 100, 101, 108, 110, 111, 112, 113, 114, 115, 130, 133, 134, 135, 136, 137, 157  [emitted]  [big]  
            3.eclwatch.js  19.5 KiB                                                                                                      3  [emitted]         
           30.eclwatch.js  1.35 MiB                                       30, 4, 7, 10, 17, 18, 21, 108, 109, 115, 133, 134, 135, 136, 137  [emitted]  [big]  
           31.eclwatch.js  1.15 MiB                                     31, 4, 10, 17, 18, 21, 108, 109, 115, 133, 134, 135, 136, 137, 157  [emitted]  [big]  
           32.eclwatch.js  1.06 MiB                     32, 4, 9, 10, 17, 18, 21, 36, 97, 102, 108, 109, 115, 133, 134, 135, 136, 137, 157  [emitted]  [big]  
           33.eclwatch.js  1.09 MiB                                                                  33, 4, 17, 18, 21, 108, 109, 115, 157  [emitted]  [big]  
           34.eclwatch.js     1 MiB                                             34, 4, 12, 17, 18, 21, 35, 96, 97, 102, 108, 109, 115, 157  [emitted]  [big]  
           35.eclwatch.js  1020 KiB                                                 35, 4, 12, 17, 18, 21, 96, 97, 102, 108, 109, 115, 157  [emitted]  [big]  
           36.eclwatch.js  1020 KiB                                 36, 4, 9, 10, 21, 97, 102, 108, 109, 115, 133, 134, 135, 136, 137, 157  [emitted]  [big]  
           37.eclwatch.js  1.09 MiB                                                                   37, 4, 7, 21, 43, 108, 109, 115, 157  [emitted]  [big]  
           38.eclwatch.js     1 MiB                                                                                              38, 4, 21  [emitted]  [big]  
           39.eclwatch.js  1010 KiB                                       39, 4, 5, 10, 17, 18, 21, 108, 109, 133, 134, 135, 136, 137, 157  [emitted]  [big]  
            4.eclwatch.js  15.7 KiB                                                                                                      4  [emitted]         
           40.eclwatch.js   996 KiB                                            40, 4, 5, 8, 10, 21, 108, 109, 133, 134, 135, 136, 137, 147  [emitted]  [big]  
           41.eclwatch.js   941 KiB                                                         41, 4, 17, 18, 21, 97, 102, 108, 109, 115, 157  [emitted]  [big]  
           42.eclwatch.js   964 KiB                                                                                      42, 8, 10, 21, 44  [emitted]  [big]  
           43.eclwatch.js   872 KiB                                                                          43, 4, 21, 108, 109, 115, 157  [emitted]  [big]  
           44.eclwatch.js   827 KiB                                                                                                 44, 21  [emitted]  [big]  
           45.eclwatch.js  1.54 MiB                45, 4, 8, 9, 10, 17, 18, 19, 20, 21, 51, 72, 97, 108, 109, 133, 134, 135, 136, 137, 157  [emitted]  [big]  
           46.eclwatch.js  1.18 MiB                                                              46, 4, 8, 9, 10, 16, 20, 72, 97, 144, 155  [emitted]  [big]  
           47.eclwatch.js  1.16 MiB                                                                 47, 8, 9, 10, 16, 20, 72, 97, 144, 155  [emitted]  [big]  
           48.eclwatch.js  1.02 MiB                                                                                      48, 9, 16, 20, 72  [emitted]  [big]  
           49.eclwatch.js  91.2 KiB                                                                             49, 97, 102, 108, 109, 115  [emitted]         
            5.eclwatch.js  14.5 KiB                                                                                                      5  [emitted]         
           50.eclwatch.js   387 KiB                                                50, 7, 10, 17, 18, 52, 71, 133, 134, 135, 136, 137, 157  [emitted]  [big]  
           51.eclwatch.js  1.42 MiB                               51, 4, 8, 10, 17, 18, 19, 20, 21, 108, 109, 133, 134, 135, 136, 137, 157  [emitted]  [big]  
           52.eclwatch.js   373 KiB                                                         52, 7, 10, 17, 18, 71, 133, 134, 135, 136, 137  [emitted]  [big]  
           53.eclwatch.js   863 KiB                                                                                         53, 4, 21, 157  [emitted]  [big]  
           54.eclwatch.js   102 KiB                                                                                   54, 9, 108, 109, 157  [emitted]         
           55.eclwatch.js   104 KiB                                                                                   55, 9, 108, 109, 157  [emitted]         
           56.eclwatch.js   102 KiB                                                                                   56, 9, 108, 109, 157  [emitted]         
           57.eclwatch.js   328 KiB                                                                57, 7, 10, 133, 134, 135, 136, 137, 157  [emitted]  [big]  
           58.eclwatch.js   146 KiB                                                                                            58, 10, 157  [emitted]         
           59.eclwatch.js   326 KiB                                                                     59, 7, 10, 133, 134, 135, 136, 137  [emitted]  [big]  
            6.eclwatch.js  14.8 KiB                                                                                                      6  [emitted]         
           60.eclwatch.js   850 KiB                                                                                              60, 4, 21  [emitted]  [big]  
           61.eclwatch.js   175 KiB                                                 61, 10, 17, 18, 108, 115, 133, 134, 135, 136, 137, 157  [emitted]         
           62.eclwatch.js  93.8 KiB                                                                                      62, 108, 115, 157  [emitted]         
           63.eclwatch.js    74 KiB                                                                                        63, 9, 102, 109  [emitted]         
           64.eclwatch.js  1.91 MiB                                                64, 4, 8, 10, 20, 21, 109, 133, 134, 135, 136, 137, 157  [emitted]  [big]  
           65.eclwatch.js    67 KiB                                                                                65, 6, 9, 102, 109, 157  [emitted]         
           66.eclwatch.js   795 KiB                              66, 10, 15, 21, 99, 110, 111, 112, 113, 114, 133, 134, 135, 136, 137, 157  [emitted]  [big]  
           67.eclwatch.js   132 KiB                                                                                                 67, 10  [emitted]         
           68.eclwatch.js   133 KiB                                                                                        68, 10, 97, 157  [emitted]         
           69.eclwatch.js   126 KiB                                                                                            69, 10, 157  [emitted]         
            7.eclwatch.js   224 KiB                                                                                                      7  [emitted]         
           70.eclwatch.js   972 KiB                                                                                              70, 8, 20  [emitted]  [big]  
           71.eclwatch.js  93.7 KiB                                                                        71, 10, 133, 134, 135, 136, 137  [emitted]         
           72.eclwatch.js    31 KiB                                                                                                     72  [emitted]         
           73.eclwatch.js  97.1 KiB                                                                                            73, 10, 157  [emitted]         
           74.eclwatch.js  87.6 KiB                                                                                             74, 17, 18  [emitted]         
           75.eclwatch.js  89.1 KiB                                                                                             75, 17, 18  [emitted]         
           76.eclwatch.js  94.8 KiB                                                                                            76, 10, 157  [emitted]         
           77.eclwatch.js  92.5 KiB                                                                                                 77, 10  [emitted]         
           78.eclwatch.js  91.7 KiB                                                                                                 78, 10  [emitted]         
           79.eclwatch.js  89.3 KiB                                                                                                 79, 10  [emitted]         
            8.eclwatch.js  34.4 KiB                                                                                                      8  [emitted]         
           80.eclwatch.js  89.7 KiB                                                                                            80, 10, 157  [emitted]         
           81.eclwatch.js  79.3 KiB                                                                                                81, 157  [emitted]         
           82.eclwatch.js    90 KiB                                                                                            82, 10, 157  [emitted]         
           83.eclwatch.js  36.1 KiB                                                                                                     83  [emitted]         
           84.eclwatch.js    37 KiB                                                                                                 84, 99  [emitted]         
           85.eclwatch.js  62.3 KiB                                                                                                85, 157  [emitted]         
           86.eclwatch.js  33.8 KiB                                                                                            86, 99, 157  [emitted]         
           87.eclwatch.js  86.6 KiB                                                                                            87, 10, 157  [emitted]         
           88.eclwatch.js    30 KiB                                                                                                 88, 99  [emitted]         
           89.eclwatch.js  63.1 KiB                                                                                                89, 157  [emitted]         
            9.eclwatch.js  24.4 KiB                                                                                                      9  [emitted]         
           90.eclwatch.js  84.4 KiB                                                                                                 90, 10  [emitted]         
           91.eclwatch.js  29.8 KiB                                                                                                 91, 99  [emitted]         
           92.eclwatch.js  32.5 KiB                                                                                                 92, 99  [emitted]         
           93.eclwatch.js  79.9 KiB                                                                                                 93, 10  [emitted]         
           94.eclwatch.js  79.7 KiB                                                                                                 94, 10  [emitted]         
           95.eclwatch.js    32 KiB                                                                                                     95  [emitted]         
           96.eclwatch.js  48.3 KiB                                                                                                96, 157  [emitted]         
           97.eclwatch.js  19.5 KiB                                                                                                     97  [emitted]         
           98.eclwatch.js    27 KiB                                                                                                     98  [emitted]         
           99.eclwatch.js  21.4 KiB                                                                                                     99  [emitted]         
      dojoLib.eclwatch.js   400 KiB                                                                                                     22  [emitted]  [big]  dojoLib
            flat-icon.eot  13.3 KiB                                                                                                         [emitted]         
            flat-icon.svg  25.2 KiB                                                                                                         [emitted]         
            flat-icon.ttf  13.1 KiB                                                                                                         [emitted]         
           flat-icon.woff  13.2 KiB                                                                                                         [emitted]         
  fontawesome-webfont.eot   162 KiB                                                                                                         [emitted]         
  fontawesome-webfont.svg   434 KiB                                                                                                         [emitted]  [big]  
  fontawesome-webfont.ttf   162 KiB                                                                                                         [emitted]         
 fontawesome-webfont.woff  95.7 KiB                                                                                                         [emitted]         
fontawesome-webfont.woff2  75.4 KiB                                                                                                         [emitted]         
         stub.eclwatch.js  1.82 MiB                                                                                                23, 138  [emitted]  [big]  stub
Entrypoint stub [big] = stub.eclwatch.js
Entrypoint dojoLib [big] = dojoLib.eclwatch.js
  [0] ./node_modules/dojo/_base/lang.js 21.4 KiB {22} {23} [built]
  [4] ./node_modules/dojo/_base/array.js 11.7 KiB {22} {23} [built]
  [6] ./node_modules/dojo/on.js 23.8 KiB {22} {23} [built]
  [7] ./node_modules/dojo/dom.js 6.23 KiB {22} {23} [built]
  [9] ./node_modules/dojo/dom-style.js 10.8 KiB {23} [built]
 [22] ./node_modules/dojo/ready.js 4.53 KiB {22} {23} [built]
 [29] ./node_modules/dojo/topic.js 1.03 KiB {23} [built]
 [32] ./node_modules/dojo/io-query.js 2.21 KiB {22} {23} [built]
 [41] ./node_modules/dojo/request/xhr.js 11.4 KiB {22} {23} [built]
 [49] ./lib/src/nlsHPCC.js 209 bytes {22} {23} [built]
 [52] ./node_modules/dojo/_base/fx.js 19.1 KiB {23} [built]
 [59] ./node_modules/dojo/request/handlers.js 2.85 KiB {22} {23} [built]
 [71] /tmp/tmp-324528f78ZAlQEzCY/dojo/dojo.js 67.5 KiB {22} {23} [built]
[158] ./eclwatch/stub.js 4.88 KiB {23} [built]
[362] ./lib/src/dojoLib.js 593 bytes {22} [built]
    + 1240 hidden modules
WARNING in asset size limit: The following asset(s) exceed the recommended size limit (244 KiB).
This can impact web performance.
Assets: 
  fontawesome-webfont.svg (434 KiB)
  11.eclwatch.js (1.89 MiB)
  19.eclwatch.js (592 KiB)
  20.eclwatch.js (420 KiB)
  dojoLib.eclwatch.js (400 KiB)
  stub.eclwatch.js (1.82 MiB)
  24.eclwatch.js (1.22 MiB)
  25.eclwatch.js (1.21 MiB)
  26.eclwatch.js (1.76 MiB)
  27.eclwatch.js (1.42 MiB)
  28.eclwatch.js (1.37 MiB)
  29.eclwatch.js (1.23 MiB)
  30.eclwatch.js (1.35 MiB)
  31.eclwatch.js (1.15 MiB)
  32.eclwatch.js (1.06 MiB)
  33.eclwatch.js (1.09 MiB)
  34.eclwatch.js (1 MiB)
  35.eclwatch.js (1020 KiB)
  36.eclwatch.js (1020 KiB)
  37.eclwatch.js (1.09 MiB)
  38.eclwatch.js (1 MiB)
  39.eclwatch.js (1010 KiB)
  40.eclwatch.js (996 KiB)
  41.eclwatch.js (941 KiB)
  42.eclwatch.js (964 KiB)
  43.eclwatch.js (872 KiB)
  44.eclwatch.js (827 KiB)
  45.eclwatch.js (1.54 MiB)
  46.eclwatch.js (1.18 MiB)
  47.eclwatch.js (1.16 MiB)
  48.eclwatch.js (1.02 MiB)
  50.eclwatch.js (387 KiB)
  51.eclwatch.js (1.42 MiB)
  52.eclwatch.js (373 KiB)
  53.eclwatch.js (863 KiB)
  57.eclwatch.js (328 KiB)
  59.eclwatch.js (326 KiB)
  60.eclwatch.js (850 KiB)
  64.eclwatch.js (1.91 MiB)
  66.eclwatch.js (795 KiB)
  70.eclwatch.js (972 KiB)
  103.eclwatch.js (677 KiB)
  149.eclwatch.js (494 KiB)
WARNING in entrypoint size limit: The following entrypoint(s) combined asset size exceeds the recommended limit (244 KiB). This can impact web performance.
Entrypoints:
  stub (1.82 MiB)
      stub.eclwatch.js
  dojoLib (400 KiB)
      dojoLib.eclwatch.js
[ 37%] Built target eclwatch
[  0%] Building CXX object aws-cpp-sdk-core/CMakeFiles/aws-cpp-sdk-core.dir/source/utils/Directory.cpp.o
[  0%] Building CXX object aws-cpp-sdk-core/CMakeFiles/aws-cpp-sdk-core.dir/source/utils/EnumParseOverflowContainer.cpp.o
[  0%] Building CXX object aws-cpp-sdk-core/CMakeFiles/aws-cpp-sdk-core.dir/source/utils/FileSystemUtils.cpp.o
[  0%] Building CXX object aws-cpp-sdk-core/CMakeFiles/aws-cpp-sdk-core.dir/source/utils/GetTheLights.cpp.o
[  0%] Building CXX object aws-cpp-sdk-core/CMakeFiles/aws-cpp-sdk-core.dir/source/utils/HashingUtils.cpp.o
[  0%] Building CXX object aws-cpp-sdk-core/CMakeFiles/aws-cpp-sdk-core.dir/source/utils/StringUtils.cpp.o
[  0%] Building CXX object aws-cpp-sdk-core/CMakeFiles/aws-cpp-sdk-core.dir/source/utils/TempFile.cpp.o
[  0%] Building CXX object aws-cpp-sdk-core/CMakeFiles/aws-cpp-sdk-core.dir/source/utils/UUID.cpp.o
[  0%] Building CXX object aws-cpp-sdk-core/CMakeFiles/aws-cpp-sdk-core.dir/source/utils/base64/Base64.cpp.o
[  0%] Building CXX object aws-cpp-sdk-core/CMakeFiles/aws-cpp-sdk-core.dir/source/utils/crypto/Cipher.cpp.o
[  0%] Building CXX object aws-cpp-sdk-core/CMakeFiles/aws-cpp-sdk-core.dir/source/utils/crypto/ContentCryptoMaterial.cpp.o
[  0%] Building CXX object aws-cpp-sdk-core/CMakeFiles/aws-cpp-sdk-core.dir/source/utils/crypto/ContentCryptoScheme.cpp.o
[  0%] Building CXX object aws-cpp-sdk-core/CMakeFiles/aws-cpp-sdk-core.dir/source/utils/crypto/CryptoBuf.cpp.o
[  0%] Building CXX object aws-cpp-sdk-core/CMakeFiles/aws-cpp-sdk-core.dir/source/utils/crypto/CryptoStream.cpp.o
[  0%] Building CXX object aws-cpp-sdk-core/CMakeFiles/aws-cpp-sdk-core.dir/source/utils/crypto/EncryptionMaterials.cpp.o
[  0%] Building CXX object aws-cpp-sdk-core/CMakeFiles/aws-cpp-sdk-core.dir/source/utils/crypto/KeyWrapAlgorithm.cpp.o
[  0%] Building CXX object aws-cpp-sdk-core/CMakeFiles/aws-cpp-sdk-core.dir/source/utils/crypto/MD5.cpp.o
[  0%] Building CXX object aws-cpp-sdk-core/CMakeFiles/aws-cpp-sdk-core.dir/source/utils/crypto/Sha256.cpp.o
[  0%] Building CXX object aws-cpp-sdk-core/CMakeFiles/aws-cpp-sdk-core.dir/source/utils/crypto/Sha256HMAC.cpp.o
[  0%] Building CXX object aws-cpp-sdk-core/CMakeFiles/aws-cpp-sdk-core.dir/source/utils/crypto/factory/Factories.cpp.o
[  0%] Building CXX object aws-cpp-sdk-core/CMakeFiles/aws-cpp-sdk-core.dir/source/utils/crypto/openssl/CryptoImpl.cpp.o
[  0%] Building CXX object aws-cpp-sdk-core/CMakeFiles/aws-cpp-sdk-core.dir/source/utils/event/EventDecoderStream.cpp.o
[  0%] Building CXX object aws-cpp-sdk-core/CMakeFiles/aws-cpp-sdk-core.dir/source/utils/event/EventEncoderStream.cpp.o
[  0%] Building CXX object aws-cpp-sdk-core/CMakeFiles/aws-cpp-sdk-core.dir/source/utils/event/EventHeader.cpp.o
[  0%] Building CXX object aws-cpp-sdk-core/CMakeFiles/aws-cpp-sdk-core.dir/source/utils/event/EventMessage.cpp.o
[  0%] Building CXX object aws-cpp-sdk-core/CMakeFiles/aws-cpp-sdk-core.dir/source/utils/event/EventStreamBuf.cpp.o
[  0%] Building CXX object aws-cpp-sdk-core/CMakeFiles/aws-cpp-sdk-core.dir/source/utils/event/EventStreamDecoder.cpp.o
[  0%] Building CXX object aws-cpp-sdk-core/CMakeFiles/aws-cpp-sdk-core.dir/source/utils/event/EventStreamEncoder.cpp.o
[  0%] Building CXX object aws-cpp-sdk-core/CMakeFiles/aws-cpp-sdk-core.dir/source/utils/event/EventStreamErrors.cpp.o
[  0%] Building CXX object aws-cpp-sdk-core/CMakeFiles/aws-cpp-sdk-core.dir/source/utils/json/JsonSerializer.cpp.o
[  0%] Building CXX object aws-cpp-sdk-core/CMakeFiles/aws-cpp-sdk-core.dir/source/utils/logging/AWSLogging.cpp.o
[  0%] Building CXX object aws-cpp-sdk-core/CMakeFiles/aws-cpp-sdk-core.dir/source/utils/logging/ConsoleLogSystem.cpp.o
[  0%] Building CXX object aws-cpp-sdk-core/CMakeFiles/aws-cpp-sdk-core.dir/source/utils/logging/DefaultLogSystem.cpp.o
[  0%] Building CXX object aws-cpp-sdk-core/CMakeFiles/aws-cpp-sdk-core.dir/source/utils/logging/FormattedLogSystem.cpp.o
[  0%] Building CXX object aws-cpp-sdk-core/CMakeFiles/aws-cpp-sdk-core.dir/source/utils/logging/LogLevel.cpp.o
[  0%] Building CXX object aws-cpp-sdk-core/CMakeFiles/aws-cpp-sdk-core.dir/source/utils/memory/AWSMemory.cpp.o
[  0%] Building CXX object aws-cpp-sdk-core/CMakeFiles/aws-cpp-sdk-core.dir/source/utils/memory/stl/SimpleStringStream.cpp.o
[  0%] Building CXX object aws-cpp-sdk-core/CMakeFiles/aws-cpp-sdk-core.dir/source/utils/stream/ConcurrentStreamBuf.cpp.o
[  0%] Building CXX object aws-cpp-sdk-core/CMakeFiles/aws-cpp-sdk-core.dir/source/utils/stream/PreallocatedStreamBuf.cpp.o
[  0%] Building CXX object aws-cpp-sdk-core/CMakeFiles/aws-cpp-sdk-core.dir/source/utils/stream/ResponseStream.cpp.o
[  0%] Building CXX object aws-cpp-sdk-core/CMakeFiles/aws-cpp-sdk-core.dir/source/utils/stream/SimpleStreamBuf.cpp.o
[  0%] Building CXX object aws-cpp-sdk-core/CMakeFiles/aws-cpp-sdk-core.dir/source/utils/threading/Executor.cpp.o
[  0%] Building CXX object aws-cpp-sdk-core/CMakeFiles/aws-cpp-sdk-core.dir/source/utils/threading/ReaderWriterLock.cpp.o
[  0%] Building CXX object aws-cpp-sdk-core/CMakeFiles/aws-cpp-sdk-core.dir/source/utils/threading/Semaphore.cpp.o
[  0%] Building CXX object aws-cpp-sdk-core/CMakeFiles/aws-cpp-sdk-core.dir/source/utils/threading/ThreadTask.cpp.o
[  0%] Building CXX object aws-cpp-sdk-core/CMakeFiles/aws-cpp-sdk-core.dir/source/utils/xml/XmlSerializer.cpp.o
[  0%] Linking CXX shared library libaws-cpp-sdk-core.so
[  0%] Built target aws-cpp-sdk-core
Scanning dependencies of target aws-cpp-sdk-sqs
[  0%] Building CXX object aws-cpp-sdk-sqs/CMakeFiles/aws-cpp-sdk-sqs.dir/source/SQSClient.cpp.o
[  0%] Building CXX object aws-cpp-sdk-sqs/CMakeFiles/aws-cpp-sdk-sqs.dir/source/SQSEndpoint.cpp.o
[  0%] Building CXX object aws-cpp-sdk-sqs/CMakeFiles/aws-cpp-sdk-sqs.dir/source/SQSErrorMarshaller.cpp.o
[  0%] Building CXX object aws-cpp-sdk-sqs/CMakeFiles/aws-cpp-sdk-sqs.dir/source/SQSErrors.cpp.o
[  0%] Building CXX object aws-cpp-sdk-sqs/CMakeFiles/aws-cpp-sdk-sqs.dir/source/model/AddPermissionRequest.cpp.o
[  0%] Building CXX object aws-cpp-sdk-sqs/CMakeFiles/aws-cpp-sdk-sqs.dir/source/model/BatchResultErrorEntry.cpp.o
[  0%] Building CXX object aws-cpp-sdk-sqs/CMakeFiles/aws-cpp-sdk-sqs.dir/source/model/ChangeMessageVisibilityBatchRequest.cpp.o
[  0%] Building CXX object aws-cpp-sdk-sqs/CMakeFiles/aws-cpp-sdk-sqs.dir/source/model/ChangeMessageVisibilityBatchRequestEntry.cpp.o
[  0%] Building CXX object aws-cpp-sdk-sqs/CMakeFiles/aws-cpp-sdk-sqs.dir/source/model/ChangeMessageVisibilityBatchResult.cpp.o
[  0%] Building CXX object aws-cpp-sdk-sqs/CMakeFiles/aws-cpp-sdk-sqs.dir/source/model/ChangeMessageVisibilityBatchResultEntry.cpp.o
[  0%] Building CXX object aws-cpp-sdk-sqs/CMakeFiles/aws-cpp-sdk-sqs.dir/source/model/ChangeMessageVisibilityRequest.cpp.o
[  0%] Building CXX object aws-cpp-sdk-sqs/CMakeFiles/aws-cpp-sdk-sqs.dir/source/model/CreateQueueRequest.cpp.o
[  0%] Building CXX object aws-cpp-sdk-sqs/CMakeFiles/aws-cpp-sdk-sqs.dir/source/model/CreateQueueResult.cpp.o
[  0%] Building CXX object aws-cpp-sdk-sqs/CMakeFiles/aws-cpp-sdk-sqs.dir/source/model/DeleteMessageBatchRequest.cpp.o
[  0%] Building CXX object aws-cpp-sdk-sqs/CMakeFiles/aws-cpp-sdk-sqs.dir/source/model/DeleteMessageBatchRequestEntry.cpp.o
[  0%] Building CXX object aws-cpp-sdk-sqs/CMakeFiles/aws-cpp-sdk-sqs.dir/source/model/DeleteMessageBatchResult.cpp.o
[  0%] Building CXX object aws-cpp-sdk-sqs/CMakeFiles/aws-cpp-sdk-sqs.dir/source/model/DeleteMessageBatchResultEntry.cpp.o
[  0%] Building CXX object aws-cpp-sdk-sqs/CMakeFiles/aws-cpp-sdk-sqs.dir/source/model/DeleteMessageRequest.cpp.o
[  0%] Building CXX object aws-cpp-sdk-sqs/CMakeFiles/aws-cpp-sdk-sqs.dir/source/model/DeleteQueueRequest.cpp.o
[100%] Building CXX object aws-cpp-sdk-sqs/CMakeFiles/aws-cpp-sdk-sqs.dir/source/model/GetQueueAttributesRequest.cpp.o
[100%] Building CXX object aws-cpp-sdk-sqs/CMakeFiles/aws-cpp-sdk-sqs.dir/source/model/GetQueueAttributesResult.cpp.o
[100%] Building CXX object aws-cpp-sdk-sqs/CMakeFiles/aws-cpp-sdk-sqs.dir/source/model/GetQueueUrlRequest.cpp.o
[100%] Building CXX object aws-cpp-sdk-sqs/CMakeFiles/aws-cpp-sdk-sqs.dir/source/model/GetQueueUrlResult.cpp.o
[100%] Building CXX object aws-cpp-sdk-sqs/CMakeFiles/aws-cpp-sdk-sqs.dir/source/model/ListDeadLetterSourceQueuesRequest.cpp.o
[100%] Building CXX object aws-cpp-sdk-sqs/CMakeFiles/aws-cpp-sdk-sqs.dir/source/model/ListDeadLetterSourceQueuesResult.cpp.o
[100%] Building CXX object aws-cpp-sdk-sqs/CMakeFiles/aws-cpp-sdk-sqs.dir/source/model/ListQueueTagsRequest.cpp.o
[100%] Building CXX object aws-cpp-sdk-sqs/CMakeFiles/aws-cpp-sdk-sqs.dir/source/model/ListQueueTagsResult.cpp.o
[100%] Building CXX object aws-cpp-sdk-sqs/CMakeFiles/aws-cpp-sdk-sqs.dir/source/model/ListQueuesRequest.cpp.o
[100%] Building CXX object aws-cpp-sdk-sqs/CMakeFiles/aws-cpp-sdk-sqs.dir/source/model/ListQueuesResult.cpp.o
[100%] Building CXX object aws-cpp-sdk-sqs/CMakeFiles/aws-cpp-sdk-sqs.dir/source/model/Message.cpp.o
[100%] Building CXX object aws-cpp-sdk-sqs/CMakeFiles/aws-cpp-sdk-sqs.dir/source/model/MessageAttributeValue.cpp.o
[100%] Building CXX object aws-cpp-sdk-sqs/CMakeFiles/aws-cpp-sdk-sqs.dir/source/model/MessageSystemAttributeName.cpp.o
[100%] Building CXX object aws-cpp-sdk-sqs/CMakeFiles/aws-cpp-sdk-sqs.dir/source/model/MessageSystemAttributeNameForSends.cpp.o
[100%] Building CXX object aws-cpp-sdk-sqs/CMakeFiles/aws-cpp-sdk-sqs.dir/source/model/MessageSystemAttributeValue.cpp.o
[100%] Building CXX object aws-cpp-sdk-sqs/CMakeFiles/aws-cpp-sdk-sqs.dir/source/model/PurgeQueueRequest.cpp.o
[100%] Building CXX object aws-cpp-sdk-sqs/CMakeFiles/aws-cpp-sdk-sqs.dir/source/model/QueueAttributeName.cpp.o
[100%] Building CXX object aws-cpp-sdk-sqs/CMakeFiles/aws-cpp-sdk-sqs.dir/source/model/ReceiveMessageRequest.cpp.o
[100%] Building CXX object aws-cpp-sdk-sqs/CMakeFiles/aws-cpp-sdk-sqs.dir/source/model/ReceiveMessageResult.cpp.o
[100%] Building CXX object aws-cpp-sdk-sqs/CMakeFiles/aws-cpp-sdk-sqs.dir/source/model/RemovePermissionRequest.cpp.o
[100%] Building CXX object aws-cpp-sdk-sqs/CMakeFiles/aws-cpp-sdk-sqs.dir/source/model/ResponseMetadata.cpp.o
[100%] Building CXX object aws-cpp-sdk-sqs/CMakeFiles/aws-cpp-sdk-sqs.dir/source/model/SendMessageBatchRequest.cpp.o
[100%] Building CXX object aws-cpp-sdk-sqs/CMakeFiles/aws-cpp-sdk-sqs.dir/source/model/SendMessageBatchRequestEntry.cpp.o
[100%] Building CXX object aws-cpp-sdk-sqs/CMakeFiles/aws-cpp-sdk-sqs.dir/source/model/SendMessageBatchResult.cpp.o
[100%] Building CXX object aws-cpp-sdk-sqs/CMakeFiles/aws-cpp-sdk-sqs.dir/source/model/SendMessageBatchResultEntry.cpp.o
[100%] Building CXX object aws-cpp-sdk-sqs/CMakeFiles/aws-cpp-sdk-sqs.dir/source/model/SendMessageRequest.cpp.o
[100%] Building CXX object aws-cpp-sdk-sqs/CMakeFiles/aws-cpp-sdk-sqs.dir/source/model/SendMessageResult.cpp.o
[100%] Building CXX object aws-cpp-sdk-sqs/CMakeFiles/aws-cpp-sdk-sqs.dir/source/model/SetQueueAttributesRequest.cpp.o
[100%] Building CXX object aws-cpp-sdk-sqs/CMakeFiles/aws-cpp-sdk-sqs.dir/source/model/TagQueueRequest.cpp.o
[100%] Building CXX object aws-cpp-sdk-sqs/CMakeFiles/aws-cpp-sdk-sqs.dir/source/model/UntagQueueRequest.cpp.o
[100%] Linking CXX shared library libaws-cpp-sdk-sqs.so
[100%] Built target aws-cpp-sdk-sqs
[  0%] Built target aws-cpp-sdk-core
Scanning dependencies of target aws-cpp-sdk-s3
[  0%] Building CXX object aws-cpp-sdk-s3/CMakeFiles/aws-cpp-sdk-s3.dir/source/S3Client.cpp.o
[  0%] Building CXX object aws-cpp-sdk-s3/CMakeFiles/aws-cpp-sdk-s3.dir/source/S3Endpoint.cpp.o
[  0%] Building CXX object aws-cpp-sdk-s3/CMakeFiles/aws-cpp-sdk-s3.dir/source/S3ErrorMarshaller.cpp.o
[  0%] Building CXX object aws-cpp-sdk-s3/CMakeFiles/aws-cpp-sdk-s3.dir/source/S3Errors.cpp.o
[  0%] Building CXX object aws-cpp-sdk-s3/CMakeFiles/aws-cpp-sdk-s3.dir/source/model/AbortIncompleteMultipartUpload.cpp.o
[  0%] Building CXX object aws-cpp-sdk-s3/CMakeFiles/aws-cpp-sdk-s3.dir/source/model/AbortMultipartUploadRequest.cpp.o
[  0%] Building CXX object aws-cpp-sdk-s3/CMakeFiles/aws-cpp-sdk-s3.dir/source/model/AbortMultipartUploadResult.cpp.o
[  0%] Building CXX object aws-cpp-sdk-s3/CMakeFiles/aws-cpp-sdk-s3.dir/source/model/AccelerateConfiguration.cpp.o
[  0%] Building CXX object aws-cpp-sdk-s3/CMakeFiles/aws-cpp-sdk-s3.dir/source/model/AccessControlPolicy.cpp.o
[  0%] Building CXX object aws-cpp-sdk-s3/CMakeFiles/aws-cpp-sdk-s3.dir/source/model/AccessControlTranslation.cpp.o
[  0%] Building CXX object aws-cpp-sdk-s3/CMakeFiles/aws-cpp-sdk-s3.dir/source/model/AnalyticsAndOperator.cpp.o
[  0%] Building CXX object aws-cpp-sdk-s3/CMakeFiles/aws-cpp-sdk-s3.dir/source/model/AnalyticsConfiguration.cpp.o
[  0%] Building CXX object aws-cpp-sdk-s3/CMakeFiles/aws-cpp-sdk-s3.dir/source/model/AnalyticsExportDestination.cpp.o
[  0%] Building CXX object aws-cpp-sdk-s3/CMakeFiles/aws-cpp-sdk-s3.dir/source/model/AnalyticsFilter.cpp.o
[  0%] Building CXX object aws-cpp-sdk-s3/CMakeFiles/aws-cpp-sdk-s3.dir/source/model/AnalyticsS3BucketDestination.cpp.o
[  0%] Building CXX object aws-cpp-sdk-s3/CMakeFiles/aws-cpp-sdk-s3.dir/source/model/AnalyticsS3ExportFileFormat.cpp.o
[  0%] Building CXX object aws-cpp-sdk-s3/CMakeFiles/aws-cpp-sdk-s3.dir/source/model/Bucket.cpp.o
[  0%] Building CXX object aws-cpp-sdk-s3/CMakeFiles/aws-cpp-sdk-s3.dir/source/model/BucketAccelerateStatus.cpp.o
[  0%] Building CXX object aws-cpp-sdk-s3/CMakeFiles/aws-cpp-sdk-s3.dir/source/model/BucketCannedACL.cpp.o
[  0%] Building CXX object aws-cpp-sdk-s3/CMakeFiles/aws-cpp-sdk-s3.dir/source/model/BucketLifecycleConfiguration.cpp.o
[  0%] Building CXX object aws-cpp-sdk-s3/CMakeFiles/aws-cpp-sdk-s3.dir/source/model/BucketLocationConstraint.cpp.o
[  0%] Building CXX object aws-cpp-sdk-s3/CMakeFiles/aws-cpp-sdk-s3.dir/source/model/BucketLoggingStatus.cpp.o
[  0%] Building CXX object aws-cpp-sdk-s3/CMakeFiles/aws-cpp-sdk-s3.dir/source/model/BucketLogsPermission.cpp.o
[  0%] Building CXX object aws-cpp-sdk-s3/CMakeFiles/aws-cpp-sdk-s3.dir/source/model/BucketVersioningStatus.cpp.o
[  0%] Building CXX object aws-cpp-sdk-s3/CMakeFiles/aws-cpp-sdk-s3.dir/source/model/CORSConfiguration.cpp.o
[  0%] Building CXX object aws-cpp-sdk-s3/CMakeFiles/aws-cpp-sdk-s3.dir/source/model/CORSRule.cpp.o
[  0%] Building CXX object aws-cpp-sdk-s3/CMakeFiles/aws-cpp-sdk-s3.dir/source/model/CSVInput.cpp.o
[  0%] Building CXX object aws-cpp-sdk-s3/CMakeFiles/aws-cpp-sdk-s3.dir/source/model/CSVOutput.cpp.o
[  0%] Building CXX object aws-cpp-sdk-s3/CMakeFiles/aws-cpp-sdk-s3.dir/source/model/CloudFunctionConfiguration.cpp.o
[  0%] Building CXX object aws-cpp-sdk-s3/CMakeFiles/aws-cpp-sdk-s3.dir/source/model/CommonPrefix.cpp.o
[  0%] Building CXX object aws-cpp-sdk-s3/CMakeFiles/aws-cpp-sdk-s3.dir/source/model/CompleteMultipartUploadRequest.cpp.o
[  0%] Building CXX object aws-cpp-sdk-s3/CMakeFiles/aws-cpp-sdk-s3.dir/source/model/CompleteMultipartUploadResult.cpp.o
[  0%] Building CXX object aws-cpp-sdk-s3/CMakeFiles/aws-cpp-sdk-s3.dir/source/model/CompletedMultipartUpload.cpp.o
[  0%] Building CXX object aws-cpp-sdk-s3/CMakeFiles/aws-cpp-sdk-s3.dir/source/model/CompletedPart.cpp.o
[  0%] Building CXX object aws-cpp-sdk-s3/CMakeFiles/aws-cpp-sdk-s3.dir/source/model/CompressionType.cpp.o
[  0%] Building CXX object aws-cpp-sdk-s3/CMakeFiles/aws-cpp-sdk-s3.dir/source/model/Condition.cpp.o
[  0%] Building CXX object aws-cpp-sdk-s3/CMakeFiles/aws-cpp-sdk-s3.dir/source/model/CopyObjectRequest.cpp.o
[  0%] Building CXX object aws-cpp-sdk-s3/CMakeFiles/aws-cpp-sdk-s3.dir/source/model/CopyObjectResult.cpp.o
[  0%] Building CXX object aws-cpp-sdk-s3/CMakeFiles/aws-cpp-sdk-s3.dir/source/model/CopyObjectResultDetails.cpp.o
[  0%] Building CXX object aws-cpp-sdk-s3/CMakeFiles/aws-cpp-sdk-s3.dir/source/model/CopyPartResult.cpp.o
[  0%] Building CXX object aws-cpp-sdk-s3/CMakeFiles/aws-cpp-sdk-s3.dir/source/model/CreateBucketConfiguration.cpp.o
[  0%] Building CXX object aws-cpp-sdk-s3/CMakeFiles/aws-cpp-sdk-s3.dir/source/model/CreateBucketRequest.cpp.o
[  0%] Building CXX object aws-cpp-sdk-s3/CMakeFiles/aws-cpp-sdk-s3.dir/source/model/CreateBucketResult.cpp.o
[  0%] Building CXX object aws-cpp-sdk-s3/CMakeFiles/aws-cpp-sdk-s3.dir/source/model/CreateMultipartUploadRequest.cpp.o
[  0%] Building CXX object aws-cpp-sdk-s3/CMakeFiles/aws-cpp-sdk-s3.dir/source/model/CreateMultipartUploadResult.cpp.o
[  0%] Building CXX object aws-cpp-sdk-s3/CMakeFiles/aws-cpp-sdk-s3.dir/source/model/DefaultRetention.cpp.o
[  0%] Building CXX object aws-cpp-sdk-s3/CMakeFiles/aws-cpp-sdk-s3.dir/source/model/Delete.cpp.o
[  0%] Building CXX object aws-cpp-sdk-s3/CMakeFiles/aws-cpp-sdk-s3.dir/source/model/DeleteBucketAnalyticsConfigurationRequest.cpp.o
[  0%] Building CXX object aws-cpp-sdk-s3/CMakeFiles/aws-cpp-sdk-s3.dir/source/model/DeleteBucketCorsRequest.cpp.o
[  0%] Building CXX object aws-cpp-sdk-s3/CMakeFiles/aws-cpp-sdk-s3.dir/source/model/DeleteBucketEncryptionRequest.cpp.o
[  0%] Building CXX object aws-cpp-sdk-s3/CMakeFiles/aws-cpp-sdk-s3.dir/source/model/DeleteBucketInventoryConfigurationRequest.cpp.o
[  0%] Building CXX object aws-cpp-sdk-s3/CMakeFiles/aws-cpp-sdk-s3.dir/source/model/DeleteBucketLifecycleRequest.cpp.o
[  0%] Building CXX object aws-cpp-sdk-s3/CMakeFiles/aws-cpp-sdk-s3.dir/source/model/DeleteBucketMetricsConfigurationRequest.cpp.o
[  0%] Building CXX object aws-cpp-sdk-s3/CMakeFiles/aws-cpp-sdk-s3.dir/source/model/DeleteBucketPolicyRequest.cpp.o
[  0%] Building CXX object aws-cpp-sdk-s3/CMakeFiles/aws-cpp-sdk-s3.dir/source/model/DeleteBucketReplicationRequest.cpp.o
[  0%] Building CXX object aws-cpp-sdk-s3/CMakeFiles/aws-cpp-sdk-s3.dir/source/model/DeleteBucketRequest.cpp.o
[  0%] Building CXX object aws-cpp-sdk-s3/CMakeFiles/aws-cpp-sdk-s3.dir/source/model/DeleteBucketTaggingRequest.cpp.o
[  0%] Building CXX object aws-cpp-sdk-s3/CMakeFiles/aws-cpp-sdk-s3.dir/source/model/DeleteBucketWebsiteRequest.cpp.o
[  0%] Building CXX object aws-cpp-sdk-s3/CMakeFiles/aws-cpp-sdk-s3.dir/source/model/DeleteMarkerEntry.cpp.o
[  0%] Building CXX object aws-cpp-sdk-s3/CMakeFiles/aws-cpp-sdk-s3.dir/source/model/DeleteMarkerReplication.cpp.o
[  0%] Building CXX object aws-cpp-sdk-s3/CMakeFiles/aws-cpp-sdk-s3.dir/source/model/DeleteMarkerReplicationStatus.cpp.o
[  0%] Building CXX object aws-cpp-sdk-s3/CMakeFiles/aws-cpp-sdk-s3.dir/source/model/DeleteObjectRequest.cpp.o
[  0%] Building CXX object aws-cpp-sdk-s3/CMakeFiles/aws-cpp-sdk-s3.dir/source/model/DeleteObjectResult.cpp.o
[  0%] Building CXX object aws-cpp-sdk-s3/CMakeFiles/aws-cpp-sdk-s3.dir/source/model/DeleteObjectTaggingRequest.cpp.o
[  0%] Building CXX object aws-cpp-sdk-s3/CMakeFiles/aws-cpp-sdk-s3.dir/source/model/DeleteObjectTaggingResult.cpp.o
[  0%] Building CXX object aws-cpp-sdk-s3/CMakeFiles/aws-cpp-sdk-s3.dir/source/model/DeleteObjectsRequest.cpp.o
[  0%] Building CXX object aws-cpp-sdk-s3/CMakeFiles/aws-cpp-sdk-s3.dir/source/model/DeleteObjectsResult.cpp.o
[  0%] Building CXX object aws-cpp-sdk-s3/CMakeFiles/aws-cpp-sdk-s3.dir/source/model/DeletePublicAccessBlockRequest.cpp.o
[  0%] Building CXX object aws-cpp-sdk-s3/CMakeFiles/aws-cpp-sdk-s3.dir/source/model/DeletedObject.cpp.o
[  0%] Building CXX object aws-cpp-sdk-s3/CMakeFiles/aws-cpp-sdk-s3.dir/source/model/Destination.cpp.o
[  0%] Building CXX object aws-cpp-sdk-s3/CMakeFiles/aws-cpp-sdk-s3.dir/source/model/EncodingType.cpp.o
[  0%] Building CXX object aws-cpp-sdk-s3/CMakeFiles/aws-cpp-sdk-s3.dir/source/model/Encryption.cpp.o
[  0%] Building CXX object aws-cpp-sdk-s3/CMakeFiles/aws-cpp-sdk-s3.dir/source/model/EncryptionConfiguration.cpp.o
[  0%] Building CXX object aws-cpp-sdk-s3/CMakeFiles/aws-cpp-sdk-s3.dir/source/model/Error.cpp.o
[  0%] Building CXX object aws-cpp-sdk-s3/CMakeFiles/aws-cpp-sdk-s3.dir/source/model/ErrorDocument.cpp.o
[  0%] Building CXX object aws-cpp-sdk-s3/CMakeFiles/aws-cpp-sdk-s3.dir/source/model/Event.cpp.o
[  0%] Building CXX object aws-cpp-sdk-s3/CMakeFiles/aws-cpp-sdk-s3.dir/source/model/ExistingObjectReplication.cpp.o
[  0%] Building CXX object aws-cpp-sdk-s3/CMakeFiles/aws-cpp-sdk-s3.dir/source/model/ExistingObjectReplicationStatus.cpp.o
[  0%] Building CXX object aws-cpp-sdk-s3/CMakeFiles/aws-cpp-sdk-s3.dir/source/model/ExpirationStatus.cpp.o
[  0%] Building CXX object aws-cpp-sdk-s3/CMakeFiles/aws-cpp-sdk-s3.dir/source/model/ExpressionType.cpp.o
[  0%] Building CXX object aws-cpp-sdk-s3/CMakeFiles/aws-cpp-sdk-s3.dir/source/model/FileHeaderInfo.cpp.o
[  0%] Building CXX object aws-cpp-sdk-s3/CMakeFiles/aws-cpp-sdk-s3.dir/source/model/FilterRule.cpp.o
[  0%] Building CXX object aws-cpp-sdk-s3/CMakeFiles/aws-cpp-sdk-s3.dir/source/model/FilterRuleName.cpp.o
[  0%] Building CXX object aws-cpp-sdk-s3/CMakeFiles/aws-cpp-sdk-s3.dir/source/model/GetBucketAccelerateConfigurationRequest.cpp.o
[  0%] Building CXX object aws-cpp-sdk-s3/CMakeFiles/aws-cpp-sdk-s3.dir/source/model/GetBucketAccelerateConfigurationResult.cpp.o
[  0%] Building CXX object aws-cpp-sdk-s3/CMakeFiles/aws-cpp-sdk-s3.dir/source/model/GetBucketAclRequest.cpp.o
[  0%] Building CXX object aws-cpp-sdk-s3/CMakeFiles/aws-cpp-sdk-s3.dir/source/model/GetBucketAclResult.cpp.o
[  0%] Building CXX object aws-cpp-sdk-s3/CMakeFiles/aws-cpp-sdk-s3.dir/source/model/GetBucketAnalyticsConfigurationRequest.cpp.o
[  0%] Building CXX object aws-cpp-sdk-s3/CMakeFiles/aws-cpp-sdk-s3.dir/source/model/GetBucketAnalyticsConfigurationResult.cpp.o
[  0%] Building CXX object aws-cpp-sdk-s3/CMakeFiles/aws-cpp-sdk-s3.dir/source/model/GetBucketCorsRequest.cpp.o
[  0%] Building CXX object aws-cpp-sdk-s3/CMakeFiles/aws-cpp-sdk-s3.dir/source/model/GetBucketCorsResult.cpp.o
[  0%] Building CXX object aws-cpp-sdk-s3/CMakeFiles/aws-cpp-sdk-s3.dir/source/model/GetBucketEncryptionRequest.cpp.o
[  0%] Building CXX object aws-cpp-sdk-s3/CMakeFiles/aws-cpp-sdk-s3.dir/source/model/GetBucketEncryptionResult.cpp.o
[  0%] Building CXX object aws-cpp-sdk-s3/CMakeFiles/aws-cpp-sdk-s3.dir/source/model/GetBucketInventoryConfigurationRequest.cpp.o
[  0%] Building CXX object aws-cpp-sdk-s3/CMakeFiles/aws-cpp-sdk-s3.dir/source/model/GetBucketInventoryConfigurationResult.cpp.o
[  0%] Building CXX object aws-cpp-sdk-s3/CMakeFiles/aws-cpp-sdk-s3.dir/source/model/GetBucketLifecycleConfigurationRequest.cpp.o
[  0%] Building CXX object aws-cpp-sdk-s3/CMakeFiles/aws-cpp-sdk-s3.dir/source/model/GetBucketLifecycleConfigurationResult.cpp.o
[  0%] Building CXX object aws-cpp-sdk-s3/CMakeFiles/aws-cpp-sdk-s3.dir/source/model/GetBucketLocationRequest.cpp.o
[  0%] Building CXX object aws-cpp-sdk-s3/CMakeFiles/aws-cpp-sdk-s3.dir/source/model/GetBucketLocationResult.cpp.o
[  0%] Building CXX object aws-cpp-sdk-s3/CMakeFiles/aws-cpp-sdk-s3.dir/source/model/GetBucketLoggingRequest.cpp.o
[  0%] Building CXX object aws-cpp-sdk-s3/CMakeFiles/aws-cpp-sdk-s3.dir/source/model/GetBucketLoggingResult.cpp.o
[  0%] Building CXX object aws-cpp-sdk-s3/CMakeFiles/aws-cpp-sdk-s3.dir/source/model/GetBucketMetricsConfigurationRequest.cpp.o
[  0%] Building CXX object aws-cpp-sdk-s3/CMakeFiles/aws-cpp-sdk-s3.dir/source/model/GetBucketMetricsConfigurationResult.cpp.o
[  0%] Building CXX object aws-cpp-sdk-s3/CMakeFiles/aws-cpp-sdk-s3.dir/source/model/GetBucketNotificationConfigurationRequest.cpp.o
[  0%] Building CXX object aws-cpp-sdk-s3/CMakeFiles/aws-cpp-sdk-s3.dir/source/model/GetBucketNotificationConfigurationResult.cpp.o
[  0%] Building CXX object aws-cpp-sdk-s3/CMakeFiles/aws-cpp-sdk-s3.dir/source/model/GetBucketPolicyRequest.cpp.o
[  0%] Building CXX object aws-cpp-sdk-s3/CMakeFiles/aws-cpp-sdk-s3.dir/source/model/GetBucketPolicyResult.cpp.o
[  0%] Building CXX object aws-cpp-sdk-s3/CMakeFiles/aws-cpp-sdk-s3.dir/source/model/GetBucketPolicyStatusRequest.cpp.o
[  0%] Building CXX object aws-cpp-sdk-s3/CMakeFiles/aws-cpp-sdk-s3.dir/source/model/GetBucketPolicyStatusResult.cpp.o
[  0%] Building CXX object aws-cpp-sdk-s3/CMakeFiles/aws-cpp-sdk-s3.dir/source/model/GetBucketReplicationRequest.cpp.o
[  0%] Building CXX object aws-cpp-sdk-s3/CMakeFiles/aws-cpp-sdk-s3.dir/source/model/GetBucketReplicationResult.cpp.o
[  0%] Building CXX object aws-cpp-sdk-s3/CMakeFiles/aws-cpp-sdk-s3.dir/source/model/GetBucketRequestPaymentRequest.cpp.o
[  0%] Building CXX object aws-cpp-sdk-s3/CMakeFiles/aws-cpp-sdk-s3.dir/source/model/GetBucketRequestPaymentResult.cpp.o
[  0%] Building CXX object aws-cpp-sdk-s3/CMakeFiles/aws-cpp-sdk-s3.dir/source/model/GetBucketTaggingRequest.cpp.o
[100%] Building CXX object aws-cpp-sdk-s3/CMakeFiles/aws-cpp-sdk-s3.dir/source/model/GetBucketTaggingResult.cpp.o
[100%] Building CXX object aws-cpp-sdk-s3/CMakeFiles/aws-cpp-sdk-s3.dir/source/model/GetBucketVersioningRequest.cpp.o
[100%] Building CXX object aws-cpp-sdk-s3/CMakeFiles/aws-cpp-sdk-s3.dir/source/model/GetBucketVersioningResult.cpp.o
[100%] Building CXX object aws-cpp-sdk-s3/CMakeFiles/aws-cpp-sdk-s3.dir/source/model/GetBucketWebsiteRequest.cpp.o
[100%] Building CXX object aws-cpp-sdk-s3/CMakeFiles/aws-cpp-sdk-s3.dir/source/model/GetBucketWebsiteResult.cpp.o
[100%] Building CXX object aws-cpp-sdk-s3/CMakeFiles/aws-cpp-sdk-s3.dir/source/model/GetObjectAclRequest.cpp.o
[100%] Building CXX object aws-cpp-sdk-s3/CMakeFiles/aws-cpp-sdk-s3.dir/source/model/GetObjectAclResult.cpp.o
[100%] Building CXX object aws-cpp-sdk-s3/CMakeFiles/aws-cpp-sdk-s3.dir/source/model/GetObjectLegalHoldRequest.cpp.o
[100%] Building CXX object aws-cpp-sdk-s3/CMakeFiles/aws-cpp-sdk-s3.dir/source/model/GetObjectLegalHoldResult.cpp.o
[100%] Building CXX object aws-cpp-sdk-s3/CMakeFiles/aws-cpp-sdk-s3.dir/source/model/GetObjectLockConfigurationRequest.cpp.o
[100%] Building CXX object aws-cpp-sdk-s3/CMakeFiles/aws-cpp-sdk-s3.dir/source/model/GetObjectLockConfigurationResult.cpp.o
[100%] Building CXX object aws-cpp-sdk-s3/CMakeFiles/aws-cpp-sdk-s3.dir/source/model/GetObjectRequest.cpp.o
[100%] Building CXX object aws-cpp-sdk-s3/CMakeFiles/aws-cpp-sdk-s3.dir/source/model/GetObjectResult.cpp.o
[100%] Building CXX object aws-cpp-sdk-s3/CMakeFiles/aws-cpp-sdk-s3.dir/source/model/GetObjectRetentionRequest.cpp.o
[100%] Building CXX object aws-cpp-sdk-s3/CMakeFiles/aws-cpp-sdk-s3.dir/source/model/GetObjectRetentionResult.cpp.o
[100%] Building CXX object aws-cpp-sdk-s3/CMakeFiles/aws-cpp-sdk-s3.dir/source/model/GetObjectTaggingRequest.cpp.o
[100%] Building CXX object aws-cpp-sdk-s3/CMakeFiles/aws-cpp-sdk-s3.dir/source/model/GetObjectTaggingResult.cpp.o
[100%] Building CXX object aws-cpp-sdk-s3/CMakeFiles/aws-cpp-sdk-s3.dir/source/model/GetObjectTorrentRequest.cpp.o
[100%] Building CXX object aws-cpp-sdk-s3/CMakeFiles/aws-cpp-sdk-s3.dir/source/model/GetObjectTorrentResult.cpp.o
[100%] Building CXX object aws-cpp-sdk-s3/CMakeFiles/aws-cpp-sdk-s3.dir/source/model/GetPublicAccessBlockRequest.cpp.o
[100%] Building CXX object aws-cpp-sdk-s3/CMakeFiles/aws-cpp-sdk-s3.dir/source/model/GetPublicAccessBlockResult.cpp.o
[100%] Building CXX object aws-cpp-sdk-s3/CMakeFiles/aws-cpp-sdk-s3.dir/source/model/GlacierJobParameters.cpp.o
[100%] Building CXX object aws-cpp-sdk-s3/CMakeFiles/aws-cpp-sdk-s3.dir/source/model/Grant.cpp.o
[100%] Building CXX object aws-cpp-sdk-s3/CMakeFiles/aws-cpp-sdk-s3.dir/source/model/Grantee.cpp.o
[100%] Building CXX object aws-cpp-sdk-s3/CMakeFiles/aws-cpp-sdk-s3.dir/source/model/HeadBucketRequest.cpp.o
[100%] Building CXX object aws-cpp-sdk-s3/CMakeFiles/aws-cpp-sdk-s3.dir/source/model/HeadObjectRequest.cpp.o
[100%] Building CXX object aws-cpp-sdk-s3/CMakeFiles/aws-cpp-sdk-s3.dir/source/model/HeadObjectResult.cpp.o
[100%] Building CXX object aws-cpp-sdk-s3/CMakeFiles/aws-cpp-sdk-s3.dir/source/model/IndexDocument.cpp.o
[100%] Building CXX object aws-cpp-sdk-s3/CMakeFiles/aws-cpp-sdk-s3.dir/source/model/Initiator.cpp.o
[100%] Building CXX object aws-cpp-sdk-s3/CMakeFiles/aws-cpp-sdk-s3.dir/source/model/InputSerialization.cpp.o
[100%] Building CXX object aws-cpp-sdk-s3/CMakeFiles/aws-cpp-sdk-s3.dir/source/model/InventoryConfiguration.cpp.o
[100%] Building CXX object aws-cpp-sdk-s3/CMakeFiles/aws-cpp-sdk-s3.dir/source/model/InventoryDestination.cpp.o
[100%] Building CXX object aws-cpp-sdk-s3/CMakeFiles/aws-cpp-sdk-s3.dir/source/model/InventoryEncryption.cpp.o
[100%] Building CXX object aws-cpp-sdk-s3/CMakeFiles/aws-cpp-sdk-s3.dir/source/model/InventoryFilter.cpp.o
[100%] Building CXX object aws-cpp-sdk-s3/CMakeFiles/aws-cpp-sdk-s3.dir/source/model/InventoryFormat.cpp.o
[100%] Building CXX object aws-cpp-sdk-s3/CMakeFiles/aws-cpp-sdk-s3.dir/source/model/InventoryFrequency.cpp.o
[100%] Building CXX object aws-cpp-sdk-s3/CMakeFiles/aws-cpp-sdk-s3.dir/source/model/InventoryIncludedObjectVersions.cpp.o
[100%] Building CXX object aws-cpp-sdk-s3/CMakeFiles/aws-cpp-sdk-s3.dir/source/model/InventoryOptionalField.cpp.o
[100%] Building CXX object aws-cpp-sdk-s3/CMakeFiles/aws-cpp-sdk-s3.dir/source/model/InventoryS3BucketDestination.cpp.o
[100%] Building CXX object aws-cpp-sdk-s3/CMakeFiles/aws-cpp-sdk-s3.dir/source/model/InventorySchedule.cpp.o
[100%] Building CXX object aws-cpp-sdk-s3/CMakeFiles/aws-cpp-sdk-s3.dir/source/model/JSONInput.cpp.o
[100%] Building CXX object aws-cpp-sdk-s3/CMakeFiles/aws-cpp-sdk-s3.dir/source/model/JSONOutput.cpp.o
[100%] Building CXX object aws-cpp-sdk-s3/CMakeFiles/aws-cpp-sdk-s3.dir/source/model/JSONType.cpp.o
[100%] Building CXX object aws-cpp-sdk-s3/CMakeFiles/aws-cpp-sdk-s3.dir/source/model/LambdaFunctionConfiguration.cpp.o
[100%] Building CXX object aws-cpp-sdk-s3/CMakeFiles/aws-cpp-sdk-s3.dir/source/model/LifecycleConfiguration.cpp.o
[100%] Building CXX object aws-cpp-sdk-s3/CMakeFiles/aws-cpp-sdk-s3.dir/source/model/LifecycleExpiration.cpp.o
[100%] Building CXX object aws-cpp-sdk-s3/CMakeFiles/aws-cpp-sdk-s3.dir/source/model/LifecycleRule.cpp.o
[100%] Building CXX object aws-cpp-sdk-s3/CMakeFiles/aws-cpp-sdk-s3.dir/source/model/LifecycleRuleAndOperator.cpp.o
[100%] Building CXX object aws-cpp-sdk-s3/CMakeFiles/aws-cpp-sdk-s3.dir/source/model/LifecycleRuleFilter.cpp.o
[100%] Building CXX object aws-cpp-sdk-s3/CMakeFiles/aws-cpp-sdk-s3.dir/source/model/ListBucketAnalyticsConfigurationsRequest.cpp.o
[100%] Building CXX object aws-cpp-sdk-s3/CMakeFiles/aws-cpp-sdk-s3.dir/source/model/ListBucketAnalyticsConfigurationsResult.cpp.o
[100%] Building CXX object aws-cpp-sdk-s3/CMakeFiles/aws-cpp-sdk-s3.dir/source/model/ListBucketInventoryConfigurationsRequest.cpp.o
[100%] Building CXX object aws-cpp-sdk-s3/CMakeFiles/aws-cpp-sdk-s3.dir/source/model/ListBucketInventoryConfigurationsResult.cpp.o
[100%] Building CXX object aws-cpp-sdk-s3/CMakeFiles/aws-cpp-sdk-s3.dir/source/model/ListBucketMetricsConfigurationsRequest.cpp.o
[100%] Building CXX object aws-cpp-sdk-s3/CMakeFiles/aws-cpp-sdk-s3.dir/source/model/ListBucketMetricsConfigurationsResult.cpp.o
[100%] Building CXX object aws-cpp-sdk-s3/CMakeFiles/aws-cpp-sdk-s3.dir/source/model/ListBucketsResult.cpp.o
[100%] Building CXX object aws-cpp-sdk-s3/CMakeFiles/aws-cpp-sdk-s3.dir/source/model/ListMultipartUploadsRequest.cpp.o
[100%] Building CXX object aws-cpp-sdk-s3/CMakeFiles/aws-cpp-sdk-s3.dir/source/model/ListMultipartUploadsResult.cpp.o
[100%] Building CXX object aws-cpp-sdk-s3/CMakeFiles/aws-cpp-sdk-s3.dir/source/model/ListObjectVersionsRequest.cpp.o
[100%] Building CXX object aws-cpp-sdk-s3/CMakeFiles/aws-cpp-sdk-s3.dir/source/model/ListObjectVersionsResult.cpp.o
[100%] Building CXX object aws-cpp-sdk-s3/CMakeFiles/aws-cpp-sdk-s3.dir/source/model/ListObjectsRequest.cpp.o
[100%] Building CXX object aws-cpp-sdk-s3/CMakeFiles/aws-cpp-sdk-s3.dir/source/model/ListObjectsResult.cpp.o
[100%] Building CXX object aws-cpp-sdk-s3/CMakeFiles/aws-cpp-sdk-s3.dir/source/model/ListObjectsV2Request.cpp.o
[100%] Building CXX object aws-cpp-sdk-s3/CMakeFiles/aws-cpp-sdk-s3.dir/source/model/ListObjectsV2Result.cpp.o
[100%] Building CXX object aws-cpp-sdk-s3/CMakeFiles/aws-cpp-sdk-s3.dir/source/model/ListPartsRequest.cpp.o
[100%] Building CXX object aws-cpp-sdk-s3/CMakeFiles/aws-cpp-sdk-s3.dir/source/model/ListPartsResult.cpp.o
[100%] Building CXX object aws-cpp-sdk-s3/CMakeFiles/aws-cpp-sdk-s3.dir/source/model/LoggingEnabled.cpp.o
[100%] Building CXX object aws-cpp-sdk-s3/CMakeFiles/aws-cpp-sdk-s3.dir/source/model/MFADelete.cpp.o
[100%] Building CXX object aws-cpp-sdk-s3/CMakeFiles/aws-cpp-sdk-s3.dir/source/model/MFADeleteStatus.cpp.o
[100%] Building CXX object aws-cpp-sdk-s3/CMakeFiles/aws-cpp-sdk-s3.dir/source/model/MetadataDirective.cpp.o
[100%] Building CXX object aws-cpp-sdk-s3/CMakeFiles/aws-cpp-sdk-s3.dir/source/model/MetadataEntry.cpp.o
[100%] Building CXX object aws-cpp-sdk-s3/CMakeFiles/aws-cpp-sdk-s3.dir/source/model/Metrics.cpp.o
[100%] Building CXX object aws-cpp-sdk-s3/CMakeFiles/aws-cpp-sdk-s3.dir/source/model/MetricsAndOperator.cpp.o
[100%] Building CXX object aws-cpp-sdk-s3/CMakeFiles/aws-cpp-sdk-s3.dir/source/model/MetricsConfiguration.cpp.o
[100%] Building CXX object aws-cpp-sdk-s3/CMakeFiles/aws-cpp-sdk-s3.dir/source/model/MetricsFilter.cpp.o
[100%] Building CXX object aws-cpp-sdk-s3/CMakeFiles/aws-cpp-sdk-s3.dir/source/model/MetricsStatus.cpp.o
[100%] Building CXX object aws-cpp-sdk-s3/CMakeFiles/aws-cpp-sdk-s3.dir/source/model/MultipartUpload.cpp.o
[100%] Building CXX object aws-cpp-sdk-s3/CMakeFiles/aws-cpp-sdk-s3.dir/source/model/NoncurrentVersionExpiration.cpp.o
[100%] Building CXX object aws-cpp-sdk-s3/CMakeFiles/aws-cpp-sdk-s3.dir/source/model/NoncurrentVersionTransition.cpp.o
[100%] Building CXX object aws-cpp-sdk-s3/CMakeFiles/aws-cpp-sdk-s3.dir/source/model/NotificationConfiguration.cpp.o
[100%] Building CXX object aws-cpp-sdk-s3/CMakeFiles/aws-cpp-sdk-s3.dir/source/model/NotificationConfigurationDeprecated.cpp.o
[100%] Building CXX object aws-cpp-sdk-s3/CMakeFiles/aws-cpp-sdk-s3.dir/source/model/NotificationConfigurationFilter.cpp.o
[100%] Building CXX object aws-cpp-sdk-s3/CMakeFiles/aws-cpp-sdk-s3.dir/source/model/Object.cpp.o
[100%] Building CXX object aws-cpp-sdk-s3/CMakeFiles/aws-cpp-sdk-s3.dir/source/model/ObjectCannedACL.cpp.o
[100%] Building CXX object aws-cpp-sdk-s3/CMakeFiles/aws-cpp-sdk-s3.dir/source/model/ObjectIdentifier.cpp.o
[100%] Building CXX object aws-cpp-sdk-s3/CMakeFiles/aws-cpp-sdk-s3.dir/source/model/ObjectLockConfiguration.cpp.o
[100%] Building CXX object aws-cpp-sdk-s3/CMakeFiles/aws-cpp-sdk-s3.dir/source/model/ObjectLockEnabled.cpp.o
[100%] Building CXX object aws-cpp-sdk-s3/CMakeFiles/aws-cpp-sdk-s3.dir/source/model/ObjectLockLegalHold.cpp.o
[100%] Building CXX object aws-cpp-sdk-s3/CMakeFiles/aws-cpp-sdk-s3.dir/source/model/ObjectLockLegalHoldStatus.cpp.o
[100%] Building CXX object aws-cpp-sdk-s3/CMakeFiles/aws-cpp-sdk-s3.dir/source/model/ObjectLockMode.cpp.o
[100%] Building CXX object aws-cpp-sdk-s3/CMakeFiles/aws-cpp-sdk-s3.dir/source/model/ObjectLockRetention.cpp.o
[100%] Building CXX object aws-cpp-sdk-s3/CMakeFiles/aws-cpp-sdk-s3.dir/source/model/ObjectLockRetentionMode.cpp.o
[100%] Building CXX object aws-cpp-sdk-s3/CMakeFiles/aws-cpp-sdk-s3.dir/source/model/ObjectLockRule.cpp.o
[100%] Building CXX object aws-cpp-sdk-s3/CMakeFiles/aws-cpp-sdk-s3.dir/source/model/ObjectStorageClass.cpp.o
[100%] Building CXX object aws-cpp-sdk-s3/CMakeFiles/aws-cpp-sdk-s3.dir/source/model/ObjectVersion.cpp.o
[100%] Building CXX object aws-cpp-sdk-s3/CMakeFiles/aws-cpp-sdk-s3.dir/source/model/ObjectVersionStorageClass.cpp.o
[100%] Building CXX object aws-cpp-sdk-s3/CMakeFiles/aws-cpp-sdk-s3.dir/source/model/OutputLocation.cpp.o
[100%] Building CXX object aws-cpp-sdk-s3/CMakeFiles/aws-cpp-sdk-s3.dir/source/model/OutputSerialization.cpp.o
[100%] Building CXX object aws-cpp-sdk-s3/CMakeFiles/aws-cpp-sdk-s3.dir/source/model/Owner.cpp.o
[100%] Building CXX object aws-cpp-sdk-s3/CMakeFiles/aws-cpp-sdk-s3.dir/source/model/OwnerOverride.cpp.o
[100%] Building CXX object aws-cpp-sdk-s3/CMakeFiles/aws-cpp-sdk-s3.dir/source/model/ParquetInput.cpp.o
[100%] Building CXX object aws-cpp-sdk-s3/CMakeFiles/aws-cpp-sdk-s3.dir/source/model/Part.cpp.o
[100%] Building CXX object aws-cpp-sdk-s3/CMakeFiles/aws-cpp-sdk-s3.dir/source/model/Payer.cpp.o
[100%] Building CXX object aws-cpp-sdk-s3/CMakeFiles/aws-cpp-sdk-s3.dir/source/model/Permission.cpp.o
[100%] Building CXX object aws-cpp-sdk-s3/CMakeFiles/aws-cpp-sdk-s3.dir/source/model/PolicyStatus.cpp.o
[100%] Building CXX object aws-cpp-sdk-s3/CMakeFiles/aws-cpp-sdk-s3.dir/source/model/Progress.cpp.o
[100%] Building CXX object aws-cpp-sdk-s3/CMakeFiles/aws-cpp-sdk-s3.dir/source/model/ProgressEvent.cpp.o
[100%] Building CXX object aws-cpp-sdk-s3/CMakeFiles/aws-cpp-sdk-s3.dir/source/model/Protocol.cpp.o
[100%] Building CXX object aws-cpp-sdk-s3/CMakeFiles/aws-cpp-sdk-s3.dir/source/model/PublicAccessBlockConfiguration.cpp.o
[100%] Building CXX object aws-cpp-sdk-s3/CMakeFiles/aws-cpp-sdk-s3.dir/source/model/PutBucketAccelerateConfigurationRequest.cpp.o
[100%] Building CXX object aws-cpp-sdk-s3/CMakeFiles/aws-cpp-sdk-s3.dir/source/model/PutBucketAclRequest.cpp.o
[100%] Building CXX object aws-cpp-sdk-s3/CMakeFiles/aws-cpp-sdk-s3.dir/source/model/PutBucketAnalyticsConfigurationRequest.cpp.o
[100%] Building CXX object aws-cpp-sdk-s3/CMakeFiles/aws-cpp-sdk-s3.dir/source/model/PutBucketCorsRequest.cpp.o
[100%] Building CXX object aws-cpp-sdk-s3/CMakeFiles/aws-cpp-sdk-s3.dir/source/model/PutBucketEncryptionRequest.cpp.o
[100%] Building CXX object aws-cpp-sdk-s3/CMakeFiles/aws-cpp-sdk-s3.dir/source/model/PutBucketInventoryConfigurationRequest.cpp.o
[100%] Building CXX object aws-cpp-sdk-s3/CMakeFiles/aws-cpp-sdk-s3.dir/source/model/PutBucketLifecycleConfigurationRequest.cpp.o
[100%] Building CXX object aws-cpp-sdk-s3/CMakeFiles/aws-cpp-sdk-s3.dir/source/model/PutBucketLoggingRequest.cpp.o
[100%] Building CXX object aws-cpp-sdk-s3/CMakeFiles/aws-cpp-sdk-s3.dir/source/model/PutBucketMetricsConfigurationRequest.cpp.o
[100%] Building CXX object aws-cpp-sdk-s3/CMakeFiles/aws-cpp-sdk-s3.dir/source/model/PutBucketNotificationConfigurationRequest.cpp.o
[100%] Building CXX object aws-cpp-sdk-s3/CMakeFiles/aws-cpp-sdk-s3.dir/source/model/PutBucketPolicyRequest.cpp.o
[100%] Building CXX object aws-cpp-sdk-s3/CMakeFiles/aws-cpp-sdk-s3.dir/source/model/PutBucketReplicationRequest.cpp.o
[100%] Building CXX object aws-cpp-sdk-s3/CMakeFiles/aws-cpp-sdk-s3.dir/source/model/PutBucketRequestPaymentRequest.cpp.o
[100%] Building CXX object aws-cpp-sdk-s3/CMakeFiles/aws-cpp-sdk-s3.dir/source/model/PutBucketTaggingRequest.cpp.o
[100%] Building CXX object aws-cpp-sdk-s3/CMakeFiles/aws-cpp-sdk-s3.dir/source/model/PutBucketVersioningRequest.cpp.o
[100%] Building CXX object aws-cpp-sdk-s3/CMakeFiles/aws-cpp-sdk-s3.dir/source/model/PutBucketWebsiteRequest.cpp.o
[100%] Building CXX object aws-cpp-sdk-s3/CMakeFiles/aws-cpp-sdk-s3.dir/source/model/PutObjectAclRequest.cpp.o
[100%] Building CXX object aws-cpp-sdk-s3/CMakeFiles/aws-cpp-sdk-s3.dir/source/model/PutObjectAclResult.cpp.o
[100%] Building CXX object aws-cpp-sdk-s3/CMakeFiles/aws-cpp-sdk-s3.dir/source/model/PutObjectLegalHoldRequest.cpp.o
[100%] Building CXX object aws-cpp-sdk-s3/CMakeFiles/aws-cpp-sdk-s3.dir/source/model/PutObjectLegalHoldResult.cpp.o
[100%] Building CXX object aws-cpp-sdk-s3/CMakeFiles/aws-cpp-sdk-s3.dir/source/model/PutObjectLockConfigurationRequest.cpp.o
[100%] Building CXX object aws-cpp-sdk-s3/CMakeFiles/aws-cpp-sdk-s3.dir/source/model/PutObjectLockConfigurationResult.cpp.o
[100%] Building CXX object aws-cpp-sdk-s3/CMakeFiles/aws-cpp-sdk-s3.dir/source/model/PutObjectRequest.cpp.o
[100%] Building CXX object aws-cpp-sdk-s3/CMakeFiles/aws-cpp-sdk-s3.dir/source/model/PutObjectResult.cpp.o
[100%] Building CXX object aws-cpp-sdk-s3/CMakeFiles/aws-cpp-sdk-s3.dir/source/model/PutObjectRetentionRequest.cpp.o
[100%] Building CXX object aws-cpp-sdk-s3/CMakeFiles/aws-cpp-sdk-s3.dir/source/model/PutObjectRetentionResult.cpp.o
[100%] Building CXX object aws-cpp-sdk-s3/CMakeFiles/aws-cpp-sdk-s3.dir/source/model/PutObjectTaggingRequest.cpp.o
[100%] Building CXX object aws-cpp-sdk-s3/CMakeFiles/aws-cpp-sdk-s3.dir/source/model/PutObjectTaggingResult.cpp.o
[100%] Building CXX object aws-cpp-sdk-s3/CMakeFiles/aws-cpp-sdk-s3.dir/source/model/PutPublicAccessBlockRequest.cpp.o
[100%] Building CXX object aws-cpp-sdk-s3/CMakeFiles/aws-cpp-sdk-s3.dir/source/model/QueueConfiguration.cpp.o
[100%] Building CXX object aws-cpp-sdk-s3/CMakeFiles/aws-cpp-sdk-s3.dir/source/model/QueueConfigurationDeprecated.cpp.o
[100%] Building CXX object aws-cpp-sdk-s3/CMakeFiles/aws-cpp-sdk-s3.dir/source/model/QuoteFields.cpp.o
[100%] Building CXX object aws-cpp-sdk-s3/CMakeFiles/aws-cpp-sdk-s3.dir/source/model/Redirect.cpp.o
[100%] Building CXX object aws-cpp-sdk-s3/CMakeFiles/aws-cpp-sdk-s3.dir/source/model/RedirectAllRequestsTo.cpp.o
[100%] Building CXX object aws-cpp-sdk-s3/CMakeFiles/aws-cpp-sdk-s3.dir/source/model/ReplicationConfiguration.cpp.o
[100%] Building CXX object aws-cpp-sdk-s3/CMakeFiles/aws-cpp-sdk-s3.dir/source/model/ReplicationRule.cpp.o
[100%] Building CXX object aws-cpp-sdk-s3/CMakeFiles/aws-cpp-sdk-s3.dir/source/model/ReplicationRuleAndOperator.cpp.o
[100%] Building CXX object aws-cpp-sdk-s3/CMakeFiles/aws-cpp-sdk-s3.dir/source/model/ReplicationRuleFilter.cpp.o
[100%] Building CXX object aws-cpp-sdk-s3/CMakeFiles/aws-cpp-sdk-s3.dir/source/model/ReplicationRuleStatus.cpp.o
[100%] Building CXX object aws-cpp-sdk-s3/CMakeFiles/aws-cpp-sdk-s3.dir/source/model/ReplicationStatus.cpp.o
[100%] Building CXX object aws-cpp-sdk-s3/CMakeFiles/aws-cpp-sdk-s3.dir/source/model/ReplicationTime.cpp.o
[100%] Building CXX object aws-cpp-sdk-s3/CMakeFiles/aws-cpp-sdk-s3.dir/source/model/ReplicationTimeStatus.cpp.o
[100%] Building CXX object aws-cpp-sdk-s3/CMakeFiles/aws-cpp-sdk-s3.dir/source/model/ReplicationTimeValue.cpp.o
[100%] Building CXX object aws-cpp-sdk-s3/CMakeFiles/aws-cpp-sdk-s3.dir/source/model/RequestCharged.cpp.o
[100%] Building CXX object aws-cpp-sdk-s3/CMakeFiles/aws-cpp-sdk-s3.dir/source/model/RequestPayer.cpp.o
[100%] Building CXX object aws-cpp-sdk-s3/CMakeFiles/aws-cpp-sdk-s3.dir/source/model/RequestPaymentConfiguration.cpp.o
[100%] Building CXX object aws-cpp-sdk-s3/CMakeFiles/aws-cpp-sdk-s3.dir/source/model/RequestProgress.cpp.o
[100%] Building CXX object aws-cpp-sdk-s3/CMakeFiles/aws-cpp-sdk-s3.dir/source/model/RestoreObjectRequest.cpp.o
[100%] Building CXX object aws-cpp-sdk-s3/CMakeFiles/aws-cpp-sdk-s3.dir/source/model/RestoreObjectResult.cpp.o
[100%] Building CXX object aws-cpp-sdk-s3/CMakeFiles/aws-cpp-sdk-s3.dir/source/model/RestoreRequest.cpp.o
[100%] Building CXX object aws-cpp-sdk-s3/CMakeFiles/aws-cpp-sdk-s3.dir/source/model/RestoreRequestType.cpp.o
[100%] Building CXX object aws-cpp-sdk-s3/CMakeFiles/aws-cpp-sdk-s3.dir/source/model/RoutingRule.cpp.o
[100%] Building CXX object aws-cpp-sdk-s3/CMakeFiles/aws-cpp-sdk-s3.dir/source/model/Rule.cpp.o
[100%] Building CXX object aws-cpp-sdk-s3/CMakeFiles/aws-cpp-sdk-s3.dir/source/model/S3KeyFilter.cpp.o
[100%] Building CXX object aws-cpp-sdk-s3/CMakeFiles/aws-cpp-sdk-s3.dir/source/model/S3Location.cpp.o
[100%] Building CXX object aws-cpp-sdk-s3/CMakeFiles/aws-cpp-sdk-s3.dir/source/model/SSEKMS.cpp.o
[100%] Building CXX object aws-cpp-sdk-s3/CMakeFiles/aws-cpp-sdk-s3.dir/source/model/SSES3.cpp.o
[100%] Building CXX object aws-cpp-sdk-s3/CMakeFiles/aws-cpp-sdk-s3.dir/source/model/ScanRange.cpp.o
[100%] Building CXX object aws-cpp-sdk-s3/CMakeFiles/aws-cpp-sdk-s3.dir/source/model/SelectObjectContentHandler.cpp.o
[100%] Building CXX object aws-cpp-sdk-s3/CMakeFiles/aws-cpp-sdk-s3.dir/source/model/SelectObjectContentRequest.cpp.o
[100%] Building CXX object aws-cpp-sdk-s3/CMakeFiles/aws-cpp-sdk-s3.dir/source/model/SelectParameters.cpp.o
[100%] Building CXX object aws-cpp-sdk-s3/CMakeFiles/aws-cpp-sdk-s3.dir/source/model/ServerSideEncryption.cpp.o
[100%] Building CXX object aws-cpp-sdk-s3/CMakeFiles/aws-cpp-sdk-s3.dir/source/model/ServerSideEncryptionByDefault.cpp.o
[100%] Building CXX object aws-cpp-sdk-s3/CMakeFiles/aws-cpp-sdk-s3.dir/source/model/ServerSideEncryptionConfiguration.cpp.o
[100%] Building CXX object aws-cpp-sdk-s3/CMakeFiles/aws-cpp-sdk-s3.dir/source/model/ServerSideEncryptionRule.cpp.o
[100%] Building CXX object aws-cpp-sdk-s3/CMakeFiles/aws-cpp-sdk-s3.dir/source/model/SourceSelectionCriteria.cpp.o
[100%] Building CXX object aws-cpp-sdk-s3/CMakeFiles/aws-cpp-sdk-s3.dir/source/model/SseKmsEncryptedObjects.cpp.o
[100%] Building CXX object aws-cpp-sdk-s3/CMakeFiles/aws-cpp-sdk-s3.dir/source/model/SseKmsEncryptedObjectsStatus.cpp.o
[100%] Building CXX object aws-cpp-sdk-s3/CMakeFiles/aws-cpp-sdk-s3.dir/source/model/Stats.cpp.o
[100%] Building CXX object aws-cpp-sdk-s3/CMakeFiles/aws-cpp-sdk-s3.dir/source/model/StatsEvent.cpp.o
[100%] Building CXX object aws-cpp-sdk-s3/CMakeFiles/aws-cpp-sdk-s3.dir/source/model/StorageClass.cpp.o
[100%] Building CXX object aws-cpp-sdk-s3/CMakeFiles/aws-cpp-sdk-s3.dir/source/model/StorageClassAnalysis.cpp.o
[100%] Building CXX object aws-cpp-sdk-s3/CMakeFiles/aws-cpp-sdk-s3.dir/source/model/StorageClassAnalysisDataExport.cpp.o
[100%] Building CXX object aws-cpp-sdk-s3/CMakeFiles/aws-cpp-sdk-s3.dir/source/model/StorageClassAnalysisSchemaVersion.cpp.o
[100%] Building CXX object aws-cpp-sdk-s3/CMakeFiles/aws-cpp-sdk-s3.dir/source/model/Tag.cpp.o
[100%] Building CXX object aws-cpp-sdk-s3/CMakeFiles/aws-cpp-sdk-s3.dir/source/model/Tagging.cpp.o
[100%] Building CXX object aws-cpp-sdk-s3/CMakeFiles/aws-cpp-sdk-s3.dir/source/model/TaggingDirective.cpp.o
[100%] Building CXX object aws-cpp-sdk-s3/CMakeFiles/aws-cpp-sdk-s3.dir/source/model/TargetGrant.cpp.o
[100%] Building CXX object aws-cpp-sdk-s3/CMakeFiles/aws-cpp-sdk-s3.dir/source/model/Tier.cpp.o
[100%] Building CXX object aws-cpp-sdk-s3/CMakeFiles/aws-cpp-sdk-s3.dir/source/model/TopicConfiguration.cpp.o
[100%] Building CXX object aws-cpp-sdk-s3/CMakeFiles/aws-cpp-sdk-s3.dir/source/model/TopicConfigurationDeprecated.cpp.o
[100%] Building CXX object aws-cpp-sdk-s3/CMakeFiles/aws-cpp-sdk-s3.dir/source/model/Transition.cpp.o
[100%] Building CXX object aws-cpp-sdk-s3/CMakeFiles/aws-cpp-sdk-s3.dir/source/model/TransitionStorageClass.cpp.o
[100%] Building CXX object aws-cpp-sdk-s3/CMakeFiles/aws-cpp-sdk-s3.dir/source/model/Type.cpp.o
[100%] Building CXX object aws-cpp-sdk-s3/CMakeFiles/aws-cpp-sdk-s3.dir/source/model/UploadPartCopyRequest.cpp.o
[100%] Building CXX object aws-cpp-sdk-s3/CMakeFiles/aws-cpp-sdk-s3.dir/source/model/UploadPartCopyResult.cpp.o
[100%] Building CXX object aws-cpp-sdk-s3/CMakeFiles/aws-cpp-sdk-s3.dir/source/model/UploadPartRequest.cpp.o
[100%] Building CXX object aws-cpp-sdk-s3/CMakeFiles/aws-cpp-sdk-s3.dir/source/model/UploadPartResult.cpp.o
[100%] Building CXX object aws-cpp-sdk-s3/CMakeFiles/aws-cpp-sdk-s3.dir/source/model/VersioningConfiguration.cpp.o
[100%] Building CXX object aws-cpp-sdk-s3/CMakeFiles/aws-cpp-sdk-s3.dir/source/model/WebsiteConfiguration.cpp.o
[100%] Linking CXX shared library libaws-cpp-sdk-s3.so
[100%] Built target aws-cpp-sdk-s3
[ 37%] No install step for 'aws-sdk-cpp'
[ 37%] Completed 'aws-sdk-cpp'
[ 37%] Built target aws-sdk-cpp
make: *** [Makefile:163: all] Error 2
res: ‘/home/centos/boost_1_71_0.tar.gz’ -> ‘build/downloads/boost_1_71_0.tar.gz’
Error(s): 19
warn(226) A package without a profile could throw errors or warnings. package: dojo-util
warn(226) A package without a profile could throw errors or warnings. package: dojo-util
	errors: 0
CMake Error at /home/centos/smoketest/PR-14916/build/generate-boost-regex-prefix/src/generate-boost-regex-stamp/download-generate-boost-regex.cmake:159 (message):
 error: downloading 'https://dl.bintray.com/boostorg/release/1.71.0/source/boost_1_71_0.tar.gz' failed
 The requested URL returned error: 403 Forbidden
 error: downloading 'https://dl.bintray.com/boostorg/release/1.71.0/source/boost_1_71_0.tar.gz' failed
 The requested URL returned error: 403 Forbidden
 error: downloading 'https://dl.bintray.com/boostorg/release/1.71.0/source/boost_1_71_0.tar.gz' failed
 The requested URL returned error: 403 Forbidden
 error: downloading 'https://dl.bintray.com/boostorg/release/1.71.0/source/boost_1_71_0.tar.gz' failed
 The requested URL returned error: 403 Forbidden
 error: downloading 'https://dl.bintray.com/boostorg/release/1.71.0/source/boost_1_71_0.tar.gz' failed
 The requested URL returned error: 403 Forbidden
 error: downloading 'https://dl.bintray.com/boostorg/release/1.71.0/source/boost_1_71_0.tar.gz' failed
 The requested URL returned error: 403 Forbidden
make[2]: *** [CMakeFiles/generate-boost-regex.dir/build.make:90: generate-boost-regex-prefix/src/generate-boost-regex-stamp/generate-boost-regex-download] Error 1
make[1]: *** [CMakeFiles/Makefile2:937: CMakeFiles/generate-boost-regex.dir/all] Error 2
make: *** [Makefile:163: all] Error 2
CMakeFiles/CMakeOutput.log copied into ../CMakeOutput-2021-05-04_08-46-31.log
CMakeFiles/CMakeError.log copied into ../CMakeError-2021-05-04_08-46-31.log
Get ECLWatch build result

ReportTimes.
Finish at: 2021-05-04_08-52-51
time logs started
Prep time   :     9 sec (00:00:09)
Build time  :   370 sec (00:06:10)
Package time:     0 sec (00:00:00)
Install time:     0 sec (00:00:00)
Start time  :     0 sec (00:00:00)
Test time   :     0 sec (00:00:00)
Stop time   :     0 sec (00:00:00)
Summary     :   379 sec (00:06:19)
time logs end

Leave a Reply

Your email address will not be published.