system: x86_64-linux | build_time: 15 minutes | https://github.com/NixOS/nixpkgs/pull/121854

Home   »   system: x86_64-linux | build_time: 15 minutes | https://github.com/NixOS/nixpkgs/pull/121854

Sourcing python-remove-tests-dir-hook
Sourcing python-catch-conflicts-hook.sh
Sourcing python-remove-bin-bytecode-hook.sh
Sourcing setuptools-build-hook
Using setuptoolsBuildPhase
Using setuptoolsShellHook
Sourcing pip-install-hook
Using pipInstallPhase
Sourcing python-imports-check-hook.sh
Using pythonImportsCheckPhase
Sourcing python-namespaces-hook
Sourcing setuptools-check-hook
Using setuptoolsCheckPhase
Sourcing pytest-check-hook
Using pytestCheckPhase
Removing setuptoolsCheckPhase
@nix { "action": "setPhase", "phase": "unpackPhase" }
unpacking sources
unpacking source archive /nix/store/y5n9xrm6lbs6xyivxm1mwq0kp392wd5c-source
source root is source
setting SOURCE_DATE_EPOCH to timestamp 315619200 of file source/setup.py
@nix { "action": "setPhase", "phase": "patchPhase" }
patching sources
@nix { "action": "setPhase", "phase": "configurePhase" }
configuring
no configure script, doing nothing
@nix { "action": "setPhase", "phase": "buildPhase" }
building
Executing setuptoolsBuildPhase
running bdist_wheel
running build
running build_py
creating build
creating build/lib
creating build/lib/pynetdicom
copying pynetdicom/pdu_items.py -> build/lib/pynetdicom
copying pynetdicom/dimse.py -> build/lib/pynetdicom
copying pynetdicom/transport.py -> build/lib/pynetdicom
copying pynetdicom/events.py -> build/lib/pynetdicom
copying pynetdicom/presentation.py -> build/lib/pynetdicom
copying pynetdicom/sop_class.py -> build/lib/pynetdicom
copying pynetdicom/_handlers.py -> build/lib/pynetdicom
copying pynetdicom/status.py -> build/lib/pynetdicom
copying pynetdicom/_version.py -> build/lib/pynetdicom
copying pynetdicom/dul.py -> build/lib/pynetdicom
copying pynetdicom/dimse_messages.py -> build/lib/pynetdicom
copying pynetdicom/__init__.py -> build/lib/pynetdicom
copying pynetdicom/pdu.py -> build/lib/pynetdicom
copying pynetdicom/ae.py -> build/lib/pynetdicom
copying pynetdicom/dsutils.py -> build/lib/pynetdicom
copying pynetdicom/acse.py -> build/lib/pynetdicom
copying pynetdicom/service_class.py -> build/lib/pynetdicom
copying pynetdicom/timer.py -> build/lib/pynetdicom
copying pynetdicom/pdu_primitives.py -> build/lib/pynetdicom
copying pynetdicom/dimse_primitives.py -> build/lib/pynetdicom
copying pynetdicom/__main__.py -> build/lib/pynetdicom
copying pynetdicom/_globals.py -> build/lib/pynetdicom
copying pynetdicom/fsm.py -> build/lib/pynetdicom
copying pynetdicom/association.py -> build/lib/pynetdicom
copying pynetdicom/service_class_n.py -> build/lib/pynetdicom
copying pynetdicom/utils.py -> build/lib/pynetdicom
copying pynetdicom/_config.py -> build/lib/pynetdicom
creating build/lib/pynetdicom/benchmarks
copying pynetdicom/benchmarks/bench_presentation.py -> build/lib/pynetdicom/benchmarks
copying pynetdicom/benchmarks/bench_pdu.py -> build/lib/pynetdicom/benchmarks
copying pynetdicom/benchmarks/__init__.py -> build/lib/pynetdicom/benchmarks
copying pynetdicom/benchmarks/bench_dimse_message.py -> build/lib/pynetdicom/benchmarks
copying pynetdicom/benchmarks/bench_c_send.py -> build/lib/pynetdicom/benchmarks
creating build/lib/pynetdicom/tests
copying pynetdicom/tests/test_fsm.py -> build/lib/pynetdicom/tests
copying pynetdicom/tests/test_pdu.py -> build/lib/pynetdicom/tests
copying pynetdicom/tests/hide_modules.py -> build/lib/pynetdicom/tests
copying pynetdicom/tests/test_service_storage.py -> build/lib/pynetdicom/tests
copying pynetdicom/tests/encoded_dimse_msg.py -> build/lib/pynetdicom/tests
copying pynetdicom/tests/dummy_n_scp.py -> build/lib/pynetdicom/tests
copying pynetdicom/tests/test_logging.py -> build/lib/pynetdicom/tests
copying pynetdicom/tests/test_dimse_msg.py -> build/lib/pynetdicom/tests
copying pynetdicom/tests/benchmark_script.py -> build/lib/pynetdicom/tests
copying pynetdicom/tests/test_events.py -> build/lib/pynetdicom/tests
copying pynetdicom/tests/test_service_qr.py -> build/lib/pynetdicom/tests
copying pynetdicom/tests/encoded_dimse_n_msg.py -> build/lib/pynetdicom/tests
copying pynetdicom/tests/test_sop.py -> build/lib/pynetdicom/tests
copying pynetdicom/tests/test_presentation.py -> build/lib/pynetdicom/tests
copying pynetdicom/tests/test_assoc_user.py -> build/lib/pynetdicom/tests
copying pynetdicom/tests/parrot.py -> build/lib/pynetdicom/tests
copying pynetdicom/tests/test_environment.py -> build/lib/pynetdicom/tests
copying pynetdicom/tests/test_status.py -> build/lib/pynetdicom/tests
copying pynetdicom/tests/test_service_relevant_patient.py -> build/lib/pynetdicom/tests
copying pynetdicom/tests/test_utils.py -> build/lib/pynetdicom/tests
copying pynetdicom/tests/test_dimse_c.py -> build/lib/pynetdicom/tests
copying pynetdicom/tests/test_assoc_n.py -> build/lib/pynetdicom/tests
copying pynetdicom/tests/test_service_non_patient.py -> build/lib/pynetdicom/tests
copying pynetdicom/tests/test_ae.py -> build/lib/pynetdicom/tests
copying pynetdicom/tests/test_timer.py -> build/lib/pynetdicom/tests
copying pynetdicom/tests/encoded_pdu_items.py -> build/lib/pynetdicom/tests
copying pynetdicom/tests/test_service_substance_admin.py -> build/lib/pynetdicom/tests
copying pynetdicom/tests/__init__.py -> build/lib/pynetdicom/tests
copying pynetdicom/tests/test_primitives.py -> build/lib/pynetdicom/tests
copying pynetdicom/tests/test_acse.py -> build/lib/pynetdicom/tests
copying pynetdicom/tests/test_transport.py -> build/lib/pynetdicom/tests
copying pynetdicom/tests/test_dimse_n.py -> build/lib/pynetdicom/tests
copying pynetdicom/tests/test_service_verification.py -> build/lib/pynetdicom/tests
copying pynetdicom/tests/dummy_c_scp.py -> build/lib/pynetdicom/tests
copying pynetdicom/tests/test_dul.py -> build/lib/pynetdicom/tests
copying pynetdicom/tests/test_pdu_items.py -> build/lib/pynetdicom/tests
copying pynetdicom/tests/test_cli.py -> build/lib/pynetdicom/tests
copying pynetdicom/tests/test_dsutils.py -> build/lib/pynetdicom/tests
copying pynetdicom/tests/test_service_class.py -> build/lib/pynetdicom/tests
copying pynetdicom/tests/test_assoc.py -> build/lib/pynetdicom/tests
copying pynetdicom/tests/test_service_n.py -> build/lib/pynetdicom/tests
copying pynetdicom/tests/test_dimse_provider.py -> build/lib/pynetdicom/tests
creating build/lib/pynetdicom/apps
copying pynetdicom/apps/common.py -> build/lib/pynetdicom/apps
copying pynetdicom/apps/__init__.py -> build/lib/pynetdicom/apps
creating build/lib/pynetdicom/apps/movescu
copying pynetdicom/apps/movescu/movescu.py -> build/lib/pynetdicom/apps/movescu
copying pynetdicom/apps/movescu/__init__.py -> build/lib/pynetdicom/apps/movescu
creating build/lib/pynetdicom/apps/storescp
copying pynetdicom/apps/storescp/storescp.py -> build/lib/pynetdicom/apps/storescp
copying pynetdicom/apps/storescp/__init__.py -> build/lib/pynetdicom/apps/storescp
creating build/lib/pynetdicom/apps/getscu
copying pynetdicom/apps/getscu/getscu.py -> build/lib/pynetdicom/apps/getscu
copying pynetdicom/apps/getscu/__init__.py -> build/lib/pynetdicom/apps/getscu
creating build/lib/pynetdicom/apps/tests
copying pynetdicom/apps/tests/test_qrscp_get.py -> build/lib/pynetdicom/apps/tests
copying pynetdicom/apps/tests/test_storescp.py -> build/lib/pynetdicom/apps/tests
copying pynetdicom/apps/tests/test_qrscp_find.py -> build/lib/pynetdicom/apps/tests
copying pynetdicom/apps/tests/test_qrscp_move.py -> build/lib/pynetdicom/apps/tests
copying pynetdicom/apps/tests/test_getscu.py -> build/lib/pynetdicom/apps/tests
copying pynetdicom/apps/tests/test_findscu.py -> build/lib/pynetdicom/apps/tests
copying pynetdicom/apps/tests/test_movescu.py -> build/lib/pynetdicom/apps/tests
copying pynetdicom/apps/tests/test_echoscp.py -> build/lib/pynetdicom/apps/tests
copying pynetdicom/apps/tests/__init__.py -> build/lib/pynetdicom/apps/tests
copying pynetdicom/apps/tests/test_storescu.py -> build/lib/pynetdicom/apps/tests
copying pynetdicom/apps/tests/test_qrscp_echo.py -> build/lib/pynetdicom/apps/tests
copying pynetdicom/apps/tests/test_echoscu.py -> build/lib/pynetdicom/apps/tests
copying pynetdicom/apps/tests/test_qrscp_db.py -> build/lib/pynetdicom/apps/tests
copying pynetdicom/apps/tests/test_common.py -> build/lib/pynetdicom/apps/tests
copying pynetdicom/apps/tests/test_qrscp_store.py -> build/lib/pynetdicom/apps/tests
creating build/lib/pynetdicom/apps/findscu
copying pynetdicom/apps/findscu/findscu.py -> build/lib/pynetdicom/apps/findscu
copying pynetdicom/apps/findscu/__init__.py -> build/lib/pynetdicom/apps/findscu
creating build/lib/pynetdicom/apps/storescu
copying pynetdicom/apps/storescu/storescu.py -> build/lib/pynetdicom/apps/storescu
copying pynetdicom/apps/storescu/__init__.py -> build/lib/pynetdicom/apps/storescu
creating build/lib/pynetdicom/apps/echoscp
copying pynetdicom/apps/echoscp/__init__.py -> build/lib/pynetdicom/apps/echoscp
copying pynetdicom/apps/echoscp/echoscp.py -> build/lib/pynetdicom/apps/echoscp
creating build/lib/pynetdicom/apps/qrscp
copying pynetdicom/apps/qrscp/qrscp.py -> build/lib/pynetdicom/apps/qrscp
copying pynetdicom/apps/qrscp/handlers.py -> build/lib/pynetdicom/apps/qrscp
copying pynetdicom/apps/qrscp/__init__.py -> build/lib/pynetdicom/apps/qrscp
copying pynetdicom/apps/qrscp/db.py -> build/lib/pynetdicom/apps/qrscp
creating build/lib/pynetdicom/apps/echoscu
copying pynetdicom/apps/echoscu/__init__.py -> build/lib/pynetdicom/apps/echoscu
copying pynetdicom/apps/echoscu/echoscu.py -> build/lib/pynetdicom/apps/echoscu
running egg_info
creating pynetdicom.egg-info
writing pynetdicom.egg-info/PKG-INFO
writing dependency_links to pynetdicom.egg-info/dependency_links.txt
writing requirements to pynetdicom.egg-info/requires.txt
writing top-level names to pynetdicom.egg-info/top_level.txt
writing manifest file 'pynetdicom.egg-info/SOURCES.txt'
reading manifest file 'pynetdicom.egg-info/SOURCES.txt'
reading manifest template 'MANIFEST.in'
writing manifest file 'pynetdicom.egg-info/SOURCES.txt'
creating build/lib/pynetdicom/tests/cert_files
copying pynetdicom/tests/cert_files/client.crt -> build/lib/pynetdicom/tests/cert_files
copying pynetdicom/tests/cert_files/client.key -> build/lib/pynetdicom/tests/cert_files
copying pynetdicom/tests/cert_files/server.crt -> build/lib/pynetdicom/tests/cert_files
copying pynetdicom/tests/cert_files/server.key -> build/lib/pynetdicom/tests/cert_files
creating build/lib/pynetdicom/tests/dicom_files
copying pynetdicom/tests/dicom_files/CTImageStorage.dcm -> build/lib/pynetdicom/tests/dicom_files
copying pynetdicom/tests/dicom_files/MRImageStorage_ExplicitVRBigEndian.dcm -> build/lib/pynetdicom/tests/dicom_files
copying pynetdicom/tests/dicom_files/MRImageStorage_JPG2000_Lossless.dcm -> build/lib/pynetdicom/tests/dicom_files
copying pynetdicom/tests/dicom_files/RTImageStorage.dcm -> build/lib/pynetdicom/tests/dicom_files
copying pynetdicom/tests/dicom_files/SCImageStorage_Deflated.dcm -> build/lib/pynetdicom/tests/dicom_files
copying pynetdicom/apps/qrscp/default.ini -> build/lib/pynetdicom/apps/qrscp
installing to build/bdist.linux-x86_64/wheel
running install
running install_lib
creating build/bdist.linux-x86_64
creating build/bdist.linux-x86_64/wheel
creating build/bdist.linux-x86_64/wheel/pynetdicom
copying build/lib/pynetdicom/pdu_items.py -> build/bdist.linux-x86_64/wheel/pynetdicom
copying build/lib/pynetdicom/dimse.py -> build/bdist.linux-x86_64/wheel/pynetdicom
copying build/lib/pynetdicom/transport.py -> build/bdist.linux-x86_64/wheel/pynetdicom
copying build/lib/pynetdicom/events.py -> build/bdist.linux-x86_64/wheel/pynetdicom
copying build/lib/pynetdicom/presentation.py -> build/bdist.linux-x86_64/wheel/pynetdicom
creating build/bdist.linux-x86_64/wheel/pynetdicom/benchmarks
copying build/lib/pynetdicom/benchmarks/bench_presentation.py -> build/bdist.linux-x86_64/wheel/pynetdicom/benchmarks
copying build/lib/pynetdicom/benchmarks/bench_pdu.py -> build/bdist.linux-x86_64/wheel/pynetdicom/benchmarks
copying build/lib/pynetdicom/benchmarks/__init__.py -> build/bdist.linux-x86_64/wheel/pynetdicom/benchmarks
copying build/lib/pynetdicom/benchmarks/bench_dimse_message.py -> build/bdist.linux-x86_64/wheel/pynetdicom/benchmarks
copying build/lib/pynetdicom/benchmarks/bench_c_send.py -> build/bdist.linux-x86_64/wheel/pynetdicom/benchmarks
copying build/lib/pynetdicom/sop_class.py -> build/bdist.linux-x86_64/wheel/pynetdicom
copying build/lib/pynetdicom/_handlers.py -> build/bdist.linux-x86_64/wheel/pynetdicom
copying build/lib/pynetdicom/status.py -> build/bdist.linux-x86_64/wheel/pynetdicom
copying build/lib/pynetdicom/_version.py -> build/bdist.linux-x86_64/wheel/pynetdicom
creating build/bdist.linux-x86_64/wheel/pynetdicom/tests
copying build/lib/pynetdicom/tests/test_fsm.py -> build/bdist.linux-x86_64/wheel/pynetdicom/tests
copying build/lib/pynetdicom/tests/test_pdu.py -> build/bdist.linux-x86_64/wheel/pynetdicom/tests
copying build/lib/pynetdicom/tests/hide_modules.py -> build/bdist.linux-x86_64/wheel/pynetdicom/tests
copying build/lib/pynetdicom/tests/test_service_storage.py -> build/bdist.linux-x86_64/wheel/pynetdicom/tests
copying build/lib/pynetdicom/tests/encoded_dimse_msg.py -> build/bdist.linux-x86_64/wheel/pynetdicom/tests
creating build/bdist.linux-x86_64/wheel/pynetdicom/tests/dicom_files
copying build/lib/pynetdicom/tests/dicom_files/CTImageStorage.dcm -> build/bdist.linux-x86_64/wheel/pynetdicom/tests/dicom_files
copying build/lib/pynetdicom/tests/dicom_files/RTImageStorage.dcm -> build/bdist.linux-x86_64/wheel/pynetdicom/tests/dicom_files
copying build/lib/pynetdicom/tests/dicom_files/SCImageStorage_Deflated.dcm -> build/bdist.linux-x86_64/wheel/pynetdicom/tests/dicom_files
copying build/lib/pynetdicom/tests/dicom_files/MRImageStorage_JPG2000_Lossless.dcm -> build/bdist.linux-x86_64/wheel/pynetdicom/tests/dicom_files
copying build/lib/pynetdicom/tests/dicom_files/MRImageStorage_ExplicitVRBigEndian.dcm -> build/bdist.linux-x86_64/wheel/pynetdicom/tests/dicom_files
copying build/lib/pynetdicom/tests/dummy_n_scp.py -> build/bdist.linux-x86_64/wheel/pynetdicom/tests
copying build/lib/pynetdicom/tests/test_logging.py -> build/bdist.linux-x86_64/wheel/pynetdicom/tests
copying build/lib/pynetdicom/tests/test_dimse_msg.py -> build/bdist.linux-x86_64/wheel/pynetdicom/tests
copying build/lib/pynetdicom/tests/benchmark_script.py -> build/bdist.linux-x86_64/wheel/pynetdicom/tests
copying build/lib/pynetdicom/tests/test_events.py -> build/bdist.linux-x86_64/wheel/pynetdicom/tests
copying build/lib/pynetdicom/tests/test_service_qr.py -> build/bdist.linux-x86_64/wheel/pynetdicom/tests
copying build/lib/pynetdicom/tests/encoded_dimse_n_msg.py -> build/bdist.linux-x86_64/wheel/pynetdicom/tests
copying build/lib/pynetdicom/tests/test_sop.py -> build/bdist.linux-x86_64/wheel/pynetdicom/tests
copying build/lib/pynetdicom/tests/test_presentation.py -> build/bdist.linux-x86_64/wheel/pynetdicom/tests
copying build/lib/pynetdicom/tests/test_assoc_user.py -> build/bdist.linux-x86_64/wheel/pynetdicom/tests
copying build/lib/pynetdicom/tests/parrot.py -> build/bdist.linux-x86_64/wheel/pynetdicom/tests
copying build/lib/pynetdicom/tests/test_environment.py -> build/bdist.linux-x86_64/wheel/pynetdicom/tests
copying build/lib/pynetdicom/tests/test_status.py -> build/bdist.linux-x86_64/wheel/pynetdicom/tests
copying build/lib/pynetdicom/tests/test_service_relevant_patient.py -> build/bdist.linux-x86_64/wheel/pynetdicom/tests
copying build/lib/pynetdicom/tests/test_utils.py -> build/bdist.linux-x86_64/wheel/pynetdicom/tests
copying build/lib/pynetdicom/tests/test_dimse_c.py -> build/bdist.linux-x86_64/wheel/pynetdicom/tests
copying build/lib/pynetdicom/tests/test_assoc_n.py -> build/bdist.linux-x86_64/wheel/pynetdicom/tests
copying build/lib/pynetdicom/tests/test_service_non_patient.py -> build/bdist.linux-x86_64/wheel/pynetdicom/tests
copying build/lib/pynetdicom/tests/test_ae.py -> build/bdist.linux-x86_64/wheel/pynetdicom/tests
copying build/lib/pynetdicom/tests/test_timer.py -> build/bdist.linux-x86_64/wheel/pynetdicom/tests
copying build/lib/pynetdicom/tests/encoded_pdu_items.py -> build/bdist.linux-x86_64/wheel/pynetdicom/tests
copying build/lib/pynetdicom/tests/test_service_substance_admin.py -> build/bdist.linux-x86_64/wheel/pynetdicom/tests
copying build/lib/pynetdicom/tests/__init__.py -> build/bdist.linux-x86_64/wheel/pynetdicom/tests
creating build/bdist.linux-x86_64/wheel/pynetdicom/tests/cert_files
copying build/lib/pynetdicom/tests/cert_files/client.crt -> build/bdist.linux-x86_64/wheel/pynetdicom/tests/cert_files
copying build/lib/pynetdicom/tests/cert_files/client.key -> build/bdist.linux-x86_64/wheel/pynetdicom/tests/cert_files
copying build/lib/pynetdicom/tests/cert_files/server.crt -> build/bdist.linux-x86_64/wheel/pynetdicom/tests/cert_files
copying build/lib/pynetdicom/tests/cert_files/server.key -> build/bdist.linux-x86_64/wheel/pynetdicom/tests/cert_files
copying build/lib/pynetdicom/tests/test_primitives.py -> build/bdist.linux-x86_64/wheel/pynetdicom/tests
copying build/lib/pynetdicom/tests/test_acse.py -> build/bdist.linux-x86_64/wheel/pynetdicom/tests
copying build/lib/pynetdicom/tests/test_transport.py -> build/bdist.linux-x86_64/wheel/pynetdicom/tests
copying build/lib/pynetdicom/tests/test_dimse_n.py -> build/bdist.linux-x86_64/wheel/pynetdicom/tests
copying build/lib/pynetdicom/tests/test_service_verification.py -> build/bdist.linux-x86_64/wheel/pynetdicom/tests
copying build/lib/pynetdicom/tests/dummy_c_scp.py -> build/bdist.linux-x86_64/wheel/pynetdicom/tests
copying build/lib/pynetdicom/tests/test_dul.py -> build/bdist.linux-x86_64/wheel/pynetdicom/tests
copying build/lib/pynetdicom/tests/test_pdu_items.py -> build/bdist.linux-x86_64/wheel/pynetdicom/tests
copying build/lib/pynetdicom/tests/test_cli.py -> build/bdist.linux-x86_64/wheel/pynetdicom/tests
copying build/lib/pynetdicom/tests/test_dsutils.py -> build/bdist.linux-x86_64/wheel/pynetdicom/tests
copying build/lib/pynetdicom/tests/test_service_class.py -> build/bdist.linux-x86_64/wheel/pynetdicom/tests
copying build/lib/pynetdicom/tests/test_assoc.py -> build/bdist.linux-x86_64/wheel/pynetdicom/tests
copying build/lib/pynetdicom/tests/test_service_n.py -> build/bdist.linux-x86_64/wheel/pynetdicom/tests
copying build/lib/pynetdicom/tests/test_dimse_provider.py -> build/bdist.linux-x86_64/wheel/pynetdicom/tests
copying build/lib/pynetdicom/dul.py -> build/bdist.linux-x86_64/wheel/pynetdicom
copying build/lib/pynetdicom/dimse_messages.py -> build/bdist.linux-x86_64/wheel/pynetdicom
copying build/lib/pynetdicom/__init__.py -> build/bdist.linux-x86_64/wheel/pynetdicom
copying build/lib/pynetdicom/pdu.py -> build/bdist.linux-x86_64/wheel/pynetdicom
copying build/lib/pynetdicom/ae.py -> build/bdist.linux-x86_64/wheel/pynetdicom
copying build/lib/pynetdicom/dsutils.py -> build/bdist.linux-x86_64/wheel/pynetdicom
copying build/lib/pynetdicom/acse.py -> build/bdist.linux-x86_64/wheel/pynetdicom
copying build/lib/pynetdicom/service_class.py -> build/bdist.linux-x86_64/wheel/pynetdicom
copying build/lib/pynetdicom/timer.py -> build/bdist.linux-x86_64/wheel/pynetdicom
copying build/lib/pynetdicom/pdu_primitives.py -> build/bdist.linux-x86_64/wheel/pynetdicom
creating build/bdist.linux-x86_64/wheel/pynetdicom/apps
copying build/lib/pynetdicom/apps/common.py -> build/bdist.linux-x86_64/wheel/pynetdicom/apps
creating build/bdist.linux-x86_64/wheel/pynetdicom/apps/movescu
copying build/lib/pynetdicom/apps/movescu/movescu.py -> build/bdist.linux-x86_64/wheel/pynetdicom/apps/movescu
copying build/lib/pynetdicom/apps/movescu/__init__.py -> build/bdist.linux-x86_64/wheel/pynetdicom/apps/movescu
creating build/bdist.linux-x86_64/wheel/pynetdicom/apps/storescp
copying build/lib/pynetdicom/apps/storescp/storescp.py -> build/bdist.linux-x86_64/wheel/pynetdicom/apps/storescp
copying build/lib/pynetdicom/apps/storescp/__init__.py -> build/bdist.linux-x86_64/wheel/pynetdicom/apps/storescp
creating build/bdist.linux-x86_64/wheel/pynetdicom/apps/getscu
copying build/lib/pynetdicom/apps/getscu/getscu.py -> build/bdist.linux-x86_64/wheel/pynetdicom/apps/getscu
copying build/lib/pynetdicom/apps/getscu/__init__.py -> build/bdist.linux-x86_64/wheel/pynetdicom/apps/getscu
creating build/bdist.linux-x86_64/wheel/pynetdicom/apps/tests
copying build/lib/pynetdicom/apps/tests/test_qrscp_get.py -> build/bdist.linux-x86_64/wheel/pynetdicom/apps/tests
copying build/lib/pynetdicom/apps/tests/test_storescp.py -> build/bdist.linux-x86_64/wheel/pynetdicom/apps/tests
copying build/lib/pynetdicom/apps/tests/test_qrscp_find.py -> build/bdist.linux-x86_64/wheel/pynetdicom/apps/tests
copying build/lib/pynetdicom/apps/tests/test_qrscp_move.py -> build/bdist.linux-x86_64/wheel/pynetdicom/apps/tests
copying build/lib/pynetdicom/apps/tests/test_getscu.py -> build/bdist.linux-x86_64/wheel/pynetdicom/apps/tests
copying build/lib/pynetdicom/apps/tests/test_findscu.py -> build/bdist.linux-x86_64/wheel/pynetdicom/apps/tests
copying build/lib/pynetdicom/apps/tests/test_movescu.py -> build/bdist.linux-x86_64/wheel/pynetdicom/apps/tests
copying build/lib/pynetdicom/apps/tests/test_echoscp.py -> build/bdist.linux-x86_64/wheel/pynetdicom/apps/tests
copying build/lib/pynetdicom/apps/tests/__init__.py -> build/bdist.linux-x86_64/wheel/pynetdicom/apps/tests
copying build/lib/pynetdicom/apps/tests/test_storescu.py -> build/bdist.linux-x86_64/wheel/pynetdicom/apps/tests
copying build/lib/pynetdicom/apps/tests/test_qrscp_echo.py -> build/bdist.linux-x86_64/wheel/pynetdicom/apps/tests
copying build/lib/pynetdicom/apps/tests/test_echoscu.py -> build/bdist.linux-x86_64/wheel/pynetdicom/apps/tests
copying build/lib/pynetdicom/apps/tests/test_qrscp_db.py -> build/bdist.linux-x86_64/wheel/pynetdicom/apps/tests
copying build/lib/pynetdicom/apps/tests/test_common.py -> build/bdist.linux-x86_64/wheel/pynetdicom/apps/tests
copying build/lib/pynetdicom/apps/tests/test_qrscp_store.py -> build/bdist.linux-x86_64/wheel/pynetdicom/apps/tests
copying build/lib/pynetdicom/apps/__init__.py -> build/bdist.linux-x86_64/wheel/pynetdicom/apps
creating build/bdist.linux-x86_64/wheel/pynetdicom/apps/findscu
copying build/lib/pynetdicom/apps/findscu/findscu.py -> build/bdist.linux-x86_64/wheel/pynetdicom/apps/findscu
copying build/lib/pynetdicom/apps/findscu/__init__.py -> build/bdist.linux-x86_64/wheel/pynetdicom/apps/findscu
creating build/bdist.linux-x86_64/wheel/pynetdicom/apps/storescu
copying build/lib/pynetdicom/apps/storescu/storescu.py -> build/bdist.linux-x86_64/wheel/pynetdicom/apps/storescu
copying build/lib/pynetdicom/apps/storescu/__init__.py -> build/bdist.linux-x86_64/wheel/pynetdicom/apps/storescu
creating build/bdist.linux-x86_64/wheel/pynetdicom/apps/echoscp
copying build/lib/pynetdicom/apps/echoscp/__init__.py -> build/bdist.linux-x86_64/wheel/pynetdicom/apps/echoscp
copying build/lib/pynetdicom/apps/echoscp/echoscp.py -> build/bdist.linux-x86_64/wheel/pynetdicom/apps/echoscp
creating build/bdist.linux-x86_64/wheel/pynetdicom/apps/qrscp
copying build/lib/pynetdicom/apps/qrscp/qrscp.py -> build/bdist.linux-x86_64/wheel/pynetdicom/apps/qrscp
copying build/lib/pynetdicom/apps/qrscp/default.ini -> build/bdist.linux-x86_64/wheel/pynetdicom/apps/qrscp
copying build/lib/pynetdicom/apps/qrscp/handlers.py -> build/bdist.linux-x86_64/wheel/pynetdicom/apps/qrscp
copying build/lib/pynetdicom/apps/qrscp/__init__.py -> build/bdist.linux-x86_64/wheel/pynetdicom/apps/qrscp
copying build/lib/pynetdicom/apps/qrscp/db.py -> build/bdist.linux-x86_64/wheel/pynetdicom/apps/qrscp
creating build/bdist.linux-x86_64/wheel/pynetdicom/apps/echoscu
copying build/lib/pynetdicom/apps/echoscu/__init__.py -> build/bdist.linux-x86_64/wheel/pynetdicom/apps/echoscu
copying build/lib/pynetdicom/apps/echoscu/echoscu.py -> build/bdist.linux-x86_64/wheel/pynetdicom/apps/echoscu
copying build/lib/pynetdicom/dimse_primitives.py -> build/bdist.linux-x86_64/wheel/pynetdicom
copying build/lib/pynetdicom/__main__.py -> build/bdist.linux-x86_64/wheel/pynetdicom
copying build/lib/pynetdicom/_globals.py -> build/bdist.linux-x86_64/wheel/pynetdicom
copying build/lib/pynetdicom/fsm.py -> build/bdist.linux-x86_64/wheel/pynetdicom
copying build/lib/pynetdicom/association.py -> build/bdist.linux-x86_64/wheel/pynetdicom
copying build/lib/pynetdicom/service_class_n.py -> build/bdist.linux-x86_64/wheel/pynetdicom
copying build/lib/pynetdicom/utils.py -> build/bdist.linux-x86_64/wheel/pynetdicom
copying build/lib/pynetdicom/_config.py -> build/bdist.linux-x86_64/wheel/pynetdicom
running install_egg_info
Copying pynetdicom.egg-info to build/bdist.linux-x86_64/wheel/pynetdicom-1.5.6-py3.8.egg-info
running install_scripts
adding license file "LICENCE.txt" (matched pattern "LICEN[CS]E*")
creating build/bdist.linux-x86_64/wheel/pynetdicom-1.5.6.dist-info/WHEEL
creating 'dist/pynetdicom-1.5.6-py2.py3-none-any.whl' and adding 'build/bdist.linux-x86_64/wheel' to it
adding 'pynetdicom/__init__.py'
adding 'pynetdicom/__main__.py'
adding 'pynetdicom/_config.py'
adding 'pynetdicom/_globals.py'
adding 'pynetdicom/_handlers.py'
adding 'pynetdicom/_version.py'
adding 'pynetdicom/acse.py'
adding 'pynetdicom/ae.py'
adding 'pynetdicom/association.py'
adding 'pynetdicom/dimse.py'
adding 'pynetdicom/dimse_messages.py'
adding 'pynetdicom/dimse_primitives.py'
adding 'pynetdicom/dsutils.py'
adding 'pynetdicom/dul.py'
adding 'pynetdicom/events.py'
adding 'pynetdicom/fsm.py'
adding 'pynetdicom/pdu.py'
adding 'pynetdicom/pdu_items.py'
adding 'pynetdicom/pdu_primitives.py'
adding 'pynetdicom/presentation.py'
adding 'pynetdicom/service_class.py'
adding 'pynetdicom/service_class_n.py'
adding 'pynetdicom/sop_class.py'
adding 'pynetdicom/status.py'
adding 'pynetdicom/timer.py'
adding 'pynetdicom/transport.py'
adding 'pynetdicom/utils.py'
adding 'pynetdicom/apps/__init__.py'
adding 'pynetdicom/apps/common.py'
adding 'pynetdicom/apps/echoscp/__init__.py'
adding 'pynetdicom/apps/echoscp/echoscp.py'
adding 'pynetdicom/apps/echoscu/__init__.py'
adding 'pynetdicom/apps/echoscu/echoscu.py'
adding 'pynetdicom/apps/findscu/__init__.py'
adding 'pynetdicom/apps/findscu/findscu.py'
adding 'pynetdicom/apps/getscu/__init__.py'
adding 'pynetdicom/apps/getscu/getscu.py'
adding 'pynetdicom/apps/movescu/__init__.py'
adding 'pynetdicom/apps/movescu/movescu.py'
adding 'pynetdicom/apps/qrscp/__init__.py'
adding 'pynetdicom/apps/qrscp/db.py'
adding 'pynetdicom/apps/qrscp/default.ini'
adding 'pynetdicom/apps/qrscp/handlers.py'
adding 'pynetdicom/apps/qrscp/qrscp.py'
adding 'pynetdicom/apps/storescp/__init__.py'
adding 'pynetdicom/apps/storescp/storescp.py'
adding 'pynetdicom/apps/storescu/__init__.py'
adding 'pynetdicom/apps/storescu/storescu.py'
adding 'pynetdicom/apps/tests/__init__.py'
adding 'pynetdicom/apps/tests/test_common.py'
adding 'pynetdicom/apps/tests/test_echoscp.py'
adding 'pynetdicom/apps/tests/test_echoscu.py'
adding 'pynetdicom/apps/tests/test_findscu.py'
adding 'pynetdicom/apps/tests/test_getscu.py'
adding 'pynetdicom/apps/tests/test_movescu.py'
adding 'pynetdicom/apps/tests/test_qrscp_db.py'
adding 'pynetdicom/apps/tests/test_qrscp_echo.py'
adding 'pynetdicom/apps/tests/test_qrscp_find.py'
adding 'pynetdicom/apps/tests/test_qrscp_get.py'
adding 'pynetdicom/apps/tests/test_qrscp_move.py'
adding 'pynetdicom/apps/tests/test_qrscp_store.py'
adding 'pynetdicom/apps/tests/test_storescp.py'
adding 'pynetdicom/apps/tests/test_storescu.py'
adding 'pynetdicom/benchmarks/__init__.py'
adding 'pynetdicom/benchmarks/bench_c_send.py'
adding 'pynetdicom/benchmarks/bench_dimse_message.py'
adding 'pynetdicom/benchmarks/bench_pdu.py'
adding 'pynetdicom/benchmarks/bench_presentation.py'
adding 'pynetdicom/tests/__init__.py'
adding 'pynetdicom/tests/benchmark_script.py'
adding 'pynetdicom/tests/dummy_c_scp.py'
adding 'pynetdicom/tests/dummy_n_scp.py'
adding 'pynetdicom/tests/encoded_dimse_msg.py'
adding 'pynetdicom/tests/encoded_dimse_n_msg.py'
adding 'pynetdicom/tests/encoded_pdu_items.py'
adding 'pynetdicom/tests/hide_modules.py'
adding 'pynetdicom/tests/parrot.py'
adding 'pynetdicom/tests/test_acse.py'
adding 'pynetdicom/tests/test_ae.py'
adding 'pynetdicom/tests/test_assoc.py'
adding 'pynetdicom/tests/test_assoc_n.py'
adding 'pynetdicom/tests/test_assoc_user.py'
adding 'pynetdicom/tests/test_cli.py'
adding 'pynetdicom/tests/test_dimse_c.py'
adding 'pynetdicom/tests/test_dimse_msg.py'
adding 'pynetdicom/tests/test_dimse_n.py'
adding 'pynetdicom/tests/test_dimse_provider.py'
adding 'pynetdicom/tests/test_dsutils.py'
adding 'pynetdicom/tests/test_dul.py'
adding 'pynetdicom/tests/test_environment.py'
adding 'pynetdicom/tests/test_events.py'
adding 'pynetdicom/tests/test_fsm.py'
adding 'pynetdicom/tests/test_logging.py'
adding 'pynetdicom/tests/test_pdu.py'
adding 'pynetdicom/tests/test_pdu_items.py'
adding 'pynetdicom/tests/test_presentation.py'
adding 'pynetdicom/tests/test_primitives.py'
adding 'pynetdicom/tests/test_service_class.py'
adding 'pynetdicom/tests/test_service_n.py'
adding 'pynetdicom/tests/test_service_non_patient.py'
adding 'pynetdicom/tests/test_service_qr.py'
adding 'pynetdicom/tests/test_service_relevant_patient.py'
adding 'pynetdicom/tests/test_service_storage.py'
adding 'pynetdicom/tests/test_service_substance_admin.py'
adding 'pynetdicom/tests/test_service_verification.py'
adding 'pynetdicom/tests/test_sop.py'
adding 'pynetdicom/tests/test_status.py'
adding 'pynetdicom/tests/test_timer.py'
adding 'pynetdicom/tests/test_transport.py'
adding 'pynetdicom/tests/test_utils.py'
adding 'pynetdicom/tests/cert_files/client.crt'
adding 'pynetdicom/tests/cert_files/client.key'
adding 'pynetdicom/tests/cert_files/server.crt'
adding 'pynetdicom/tests/cert_files/server.key'
adding 'pynetdicom/tests/dicom_files/CTImageStorage.dcm'
adding 'pynetdicom/tests/dicom_files/MRImageStorage_ExplicitVRBigEndian.dcm'
adding 'pynetdicom/tests/dicom_files/MRImageStorage_JPG2000_Lossless.dcm'
adding 'pynetdicom/tests/dicom_files/RTImageStorage.dcm'
adding 'pynetdicom/tests/dicom_files/SCImageStorage_Deflated.dcm'
adding 'pynetdicom-1.5.6.dist-info/LICENCE.txt'
adding 'pynetdicom-1.5.6.dist-info/METADATA'
adding 'pynetdicom-1.5.6.dist-info/WHEEL'
adding 'pynetdicom-1.5.6.dist-info/top_level.txt'
adding 'pynetdicom-1.5.6.dist-info/RECORD'
removing build/bdist.linux-x86_64/wheel
Finished executing setuptoolsBuildPhase
@nix { "action": "setPhase", "phase": "installPhase" }
installing
Executing pipInstallPhase
/build/source/dist /build/source
Processing ./pynetdicom-1.5.6-py2.py3-none-any.whl
Requirement already satisfied: pydicom>=1.4.2 in /nix/store/zikzb9dglfjwml2jizw701fi9afsp2d9-python3.8-pydicom-2.1.2/lib/python3.8/site-packages (from pynetdicom==1.5.6) (2.1.2)
Installing collected packages: pynetdicom
Successfully installed pynetdicom-1.5.6
/build/source
Finished executing pipInstallPhase
@nix { "action": "setPhase", "phase": "fixupPhase" }
post-installation fixup
shrinking RPATHs of ELF executables and libraries in /nix/store/bz9n02xcv3i43ws63qwmr58g2izh25xx-python3.8-pynetdicom-1.5.6
strip is /nix/store/5xyjd2qiily84lcv2w2grmwsb8r1hqpr-binutils-2.35.1/bin/strip
stripping (with command strip and flags -S) in /nix/store/bz9n02xcv3i43ws63qwmr58g2izh25xx-python3.8-pynetdicom-1.5.6/lib 
patching script interpreter paths in /nix/store/bz9n02xcv3i43ws63qwmr58g2izh25xx-python3.8-pynetdicom-1.5.6
checking for references to /build/ in /nix/store/bz9n02xcv3i43ws63qwmr58g2izh25xx-python3.8-pynetdicom-1.5.6...
Executing pythonRemoveTestsDir
Finished executing pythonRemoveTestsDir
@nix { "action": "setPhase", "phase": "installCheckPhase" }
running install tests
no Makefile or custom installCheckPhase, doing nothing
@nix { "action": "setPhase", "phase": "pythonCatchConflictsPhase" }
pythonCatchConflictsPhase
@nix { "action": "setPhase", "phase": "pythonRemoveBinBytecodePhase" }
pythonRemoveBinBytecodePhase
@nix { "action": "setPhase", "phase": "pythonImportsCheckPhase" }
pythonImportsCheckPhase
Executing pythonImportsCheckPhase
Check whether the following modules can be imported: pynetdicom
@nix { "action": "setPhase", "phase": "pytestCheckPhase" }
pytestCheckPhase
Executing pytestCheckPhase
============================= test session starts ==============================
platform linux -- Python 3.8.9, pytest-6.2.3, py-1.10.0, pluggy-0.13.1
rootdir: /build/source
plugins: pyfakefs-4.4.0
collecting ... 
collecting 4 items                                                             
collecting 249 items                                                           
collecting 439 items                                                           
collecting 739 items                                                           
collecting 1042 items                                                          
collecting 1166 items                                                          
collecting 1386 items                                                          
collecting 1740 items                                                          
collecting 1850 items                                                          
collecting 2038 items                                                          
collecting 2805 items                                                          
collecting 2874 items                                                          
collecting 3155 items                                                          
collected 3267 items / 550 deselected / 2717 selected                          

pynetdicom/apps/tests/test_common.py ................................... [  1%]
...............                                                          [  1%]
pynetdicom/apps/tests/test_echoscu.py .......s....s.............s....s.. [  3%]
....                                                                     [  3%]
pynetdicom/apps/tests/test_findscu.py ........s....s..............s....s [  4%]
......                                                                   [  4%]
pynetdicom/apps/tests/test_getscu.py ........s....s..............s..F.s. [  5%]
.....                                                                    [  6%]
pynetdicom/apps/tests/test_movescu.py ........s.....s.................s. [  7%]
....s.........                                                           [  7%]
pynetdicom/apps/tests/test_qrscp_db.py .............................s... [  9%]
..........................................                               [ 10%]
pynetdicom/tests/test_acse.py .......................................... [ 12%]
........................................................................ [ 14%]
........................................................................ [ 17%]
...                                                                      [ 17%]
pynetdicom/tests/test_ae.py ............................................ [ 19%]
.............................................                            [ 20%]
pynetdicom/tests/test_assoc.py ......................................... [ 22%]
........................................................................ [ 25%]
........................................................................ [ 27%]
.........                                                                [ 28%]
pynetdicom/tests/test_assoc_n.py ....................................... [ 29%]
.............................................                            [ 31%]
pynetdicom/tests/test_assoc_user.py .................................... [ 32%]
............................................................             [ 34%]
pynetdicom/tests/test_cli.py ..                                          [ 34%]
pynetdicom/tests/test_dimse_c.py ....................................... [ 36%]
......                                                                   [ 36%]
pynetdicom/tests/test_dimse_msg.py .......................               [ 37%]
pynetdicom/tests/test_dimse_n.py ....................................... [ 38%]
.........                                                                [ 39%]
pynetdicom/tests/test_dimse_provider.py ......................           [ 39%]
pynetdicom/tests/test_dsutils.py ....................................... [ 41%]
...................                                                      [ 41%]
pynetdicom/tests/test_dul.py .....                                       [ 42%]
pynetdicom/tests/test_environment.py s.................                  [ 42%]
pynetdicom/tests/test_events.py ....................................     [ 44%]
pynetdicom/tests/test_fsm.py ..........                                  [ 44%]
pynetdicom/tests/test_logging.py ....................................... [ 45%]
..............................                                           [ 47%]
pynetdicom/tests/test_pdu.py ........................................... [ 48%]
..................................................................       [ 51%]
pynetdicom/tests/test_pdu_items.py ..................................... [ 52%]
........................................................................ [ 55%]
......................................................................   [ 57%]
pynetdicom/tests/test_presentation.py .................................. [ 58%]
........................................................................ [ 61%]
........................................................................ [ 64%]
........................................................................ [ 66%]
....................                                                     [ 67%]
pynetdicom/tests/test_primitives.py .................................... [ 68%]
...........                                                              [ 69%]
pynetdicom/tests/test_service_class.py ............                      [ 69%]
pynetdicom/tests/test_service_n.py ..................................... [ 71%]
........................................................................ [ 73%]
........................................................................ [ 76%]
........................................................................ [ 79%]
........................................................................ [ 81%]
........................................................................ [ 84%]
........................................................................ [ 87%]
.........................                                                [ 87%]
pynetdicom/tests/test_service_non_patient.py ............                [ 88%]
pynetdicom/tests/test_service_qr.py .................................    [ 89%]
pynetdicom/tests/test_service_relevant_patient.py ...................... [ 90%]
                                                                         [ 90%]
pynetdicom/tests/test_service_storage.py ....................            [ 91%]
pynetdicom/tests/test_service_substance_admin.py ......................  [ 91%]
pynetdicom/tests/test_service_verification.py ...............            [ 92%]
pynetdicom/tests/test_sop.py ........................................... [ 94%]
..........                                                               [ 94%]
pynetdicom/tests/test_status.py ......................                   [ 95%]
pynetdicom/tests/test_timer.py .......                                   [ 95%]
pynetdicom/tests/test_transport.py ................s.................... [ 96%]
..................                                                       [ 97%]
pynetdicom/tests/test_utils.py ......................................... [ 99%]
.........................                                                [100%]

=================================== FAILURES ===================================
__________________________ TestGetSCUCLI.test_flag_ta __________________________

self = 
capfd = <_pytest.capture.CaptureFixture object at 0x7fffdc0a8ee0>

    def test_flag_ta(self, capfd):
        """Test --acse-timeout flag."""
        events = []
    
        def handle_requested(event):
            events.append(event)
            time.sleep(0.1)
    
        def handle_get(event):
            events.append(event)
            yield 0
            yield 0x0000, None
    
        def handle_abort(event):
            events.append(event)
    
        handlers = [
            (evt.EVT_C_GET, handle_get),
            (evt.EVT_ABORTED, handle_abort),
            (evt.EVT_REQUESTED, handle_requested),
        ]
    
        self.ae = ae = AE()
        ae.acse_timeout = 5
        ae.dimse_timeout = 5
        ae.network_timeout = 5
        ae.supported_contexts = QueryRetrievePresentationContexts
        scp = ae.start_server(('', 11112), block=False, evt_handlers=handlers)
    
        p = self.func(['-ta', '0.05', '-d', '-k', 'PatientName='])
        p.wait()
        assert p.returncode == 1
    
        time.sleep(0.1)
    
        scp.shutdown()
    
        out, err = capfd.readouterr()
        assert "ACSE timeout reached while waiting for response" in err
>       assert events[0].event == evt.EVT_REQUESTED
E       IndexError: list index out of range

pynetdicom/apps/tests/test_getscu.py:353: IndexError
=============================== warnings summary ===============================
../../nix/store/zikzb9dglfjwml2jizw701fi9afsp2d9-python3.8-pydicom-2.1.2/lib/python3.8/site-packages/pydicom/uid.py:36
../../nix/store/zikzb9dglfjwml2jizw701fi9afsp2d9-python3.8-pydicom-2.1.2/lib/python3.8/site-packages/pydicom/uid.py:36
  /nix/store/zikzb9dglfjwml2jizw701fi9afsp2d9-python3.8-pydicom-2.1.2/lib/python3.8/site-packages/pydicom/uid.py:36: DeprecationWarning: The UID constant 'JPEGBaseline' is deprecated and will be removed in pydicom v2.2, use 'JPEGBaseline8Bit' instead
    warnings.warn(

../../nix/store/zikzb9dglfjwml2jizw701fi9afsp2d9-python3.8-pydicom-2.1.2/lib/python3.8/site-packages/pydicom/uid.py:36
  /nix/store/zikzb9dglfjwml2jizw701fi9afsp2d9-python3.8-pydicom-2.1.2/lib/python3.8/site-packages/pydicom/uid.py:36: DeprecationWarning: The UID constant 'JPEGExtended' is deprecated and will be removed in pydicom v2.2, use 'JPEGExtended12Bit' instead
    warnings.warn(

../../nix/store/zikzb9dglfjwml2jizw701fi9afsp2d9-python3.8-pydicom-2.1.2/lib/python3.8/site-packages/pydicom/uid.py:30
  /nix/store/zikzb9dglfjwml2jizw701fi9afsp2d9-python3.8-pydicom-2.1.2/lib/python3.8/site-packages/pydicom/uid.py:30: UserWarning: In pydicom v3.0 the UID for 'JPEGLossless' will change from '1.2.840.10008.1.2.4.70' to '1.2.840.10008.1.2.4.57' to match its UID keyword. Use 'JPEGLosslessSV1' instead
    warnings.warn(

../../nix/store/zikzb9dglfjwml2jizw701fi9afsp2d9-python3.8-pydicom-2.1.2/lib/python3.8/site-packages/pydicom/uid.py:36
  /nix/store/zikzb9dglfjwml2jizw701fi9afsp2d9-python3.8-pydicom-2.1.2/lib/python3.8/site-packages/pydicom/uid.py:36: DeprecationWarning: The UID constant 'JPEGLSLossy' is deprecated and will be removed in pydicom v2.2, use 'JPEGLSNearLossless' instead
    warnings.warn(

../../nix/store/zikzb9dglfjwml2jizw701fi9afsp2d9-python3.8-pydicom-2.1.2/lib/python3.8/site-packages/pydicom/uid.py:36
  /nix/store/zikzb9dglfjwml2jizw701fi9afsp2d9-python3.8-pydicom-2.1.2/lib/python3.8/site-packages/pydicom/uid.py:36: DeprecationWarning: The UID constant 'JPEG2000MultiComponentLossless' is deprecated and will be removed in pydicom v2.2, use 'JPEG2000MCLossless' instead
    warnings.warn(

../../nix/store/zikzb9dglfjwml2jizw701fi9afsp2d9-python3.8-pydicom-2.1.2/lib/python3.8/site-packages/pydicom/uid.py:36
  /nix/store/zikzb9dglfjwml2jizw701fi9afsp2d9-python3.8-pydicom-2.1.2/lib/python3.8/site-packages/pydicom/uid.py:36: DeprecationWarning: The UID constant 'JPEG2000MultiComponent' is deprecated and will be removed in pydicom v2.2, use 'JPEG2000MC' instead
    warnings.warn(

pynetdicom/apps/tests/test_getscu.py: 36 warnings
pynetdicom/apps/tests/test_movescu.py: 44 warnings
pynetdicom/tests/test_assoc.py: 57 warnings
pynetdicom/tests/test_service_n.py: 29 warnings
pynetdicom/tests/test_service_qr.py: 2 warnings
pynetdicom/tests/test_service_storage.py: 2 warnings
  /nix/store/zikzb9dglfjwml2jizw701fi9afsp2d9-python3.8-pydicom-2.1.2/lib/python3.8/site-packages/pydicom/dataset.py:1999: DeprecationWarning: Starting in pydicom 3.0, Dataset.file_meta must be a FileMetaDataset class instance
    warnings.warn(

pynetdicom/apps/tests/test_getscu.py::TestGetSCUCLI::test_flag_ta
  /nix/store/jmzx9dsqb96865swyvs0ib9g5dz2qdwg-python3.8-pytest-6.2.3/lib/python3.8/site-packages/_pytest/threadexception.py:75: PytestUnhandledThreadExceptionWarning: Exception in thread Thread-230
  
  Traceback (most recent call last):
    File "/nix/store/q6gfck5czr67090pwm53xrdyhpg6bx67-python3-3.8.9/lib/python3.8/threading.py", line 932, in _bootstrap_inner
      self.run()
    File "/build/source/pynetdicom/dul.py", line 416, in run
      self.state_machine.do_action(event)
    File "/build/source/pynetdicom/fsm.py", line 76, in do_action
      next_state = action[1](self.dul)
    File "/build/source/pynetdicom/fsm.py", line 296, in AE_6
      if dul.pdu.protocol_version != 0x0001:
  AttributeError: 'A_ABORT_RQ' object has no attribute 'protocol_version'
  
    warnings.warn(pytest.PytestUnhandledThreadExceptionWarning(msg))

pynetdicom/apps/tests/test_qrscp_db.py::TestAddInstance::test_bad_instance_none
  /nix/store/i9n1s376m5h1kzbd9v0p12if27dy0d2q-python3.8-SQLAlchemy-1.4.13/lib/python3.8/site-packages/sqlalchemy/sql/crud.py:1052: SAWarning: Column 'instance.sop_instance_uid' is marked as a member of the primary key for table 'instance', but has no Python-side or server-side default generator indicated, nor does it indicate 'autoincrement=True' or 'nullable=True', and no explicit value is passed.  Primary key columns typically may not store NULL.
    util.warn(msg)

pynetdicom/tests/test_assoc.py::TestAssociation::test_require_called_aet
  /nix/store/jmzx9dsqb96865swyvs0ib9g5dz2qdwg-python3.8-pytest-6.2.3/lib/python3.8/site-packages/_pytest/threadexception.py:75: PytestUnhandledThreadExceptionWarning: Exception in thread Thread-1381
  
  Traceback (most recent call last):
    File "/nix/store/q6gfck5czr67090pwm53xrdyhpg6bx67-python3-3.8.9/lib/python3.8/threading.py", line 932, in _bootstrap_inner
      self.run()
    File "/build/source/pynetdicom/dul.py", line 416, in run
      self.state_machine.do_action(event)
    File "/build/source/pynetdicom/fsm.py", line 64, in do_action
      raise InvalidEventError(msg)
  pynetdicom.fsm.InvalidEventError: Invalid event 'Evt15' for the current state 'Sta13'
  
    warnings.warn(pytest.PytestUnhandledThreadExceptionWarning(msg))

pynetdicom/tests/test_assoc.py::TestAssociation::test_require_calling_aet
  /nix/store/jmzx9dsqb96865swyvs0ib9g5dz2qdwg-python3.8-pytest-6.2.3/lib/python3.8/site-packages/_pytest/threadexception.py:75: PytestUnhandledThreadExceptionWarning: Exception in thread Thread-1386
  
  Traceback (most recent call last):
    File "/nix/store/q6gfck5czr67090pwm53xrdyhpg6bx67-python3-3.8.9/lib/python3.8/threading.py", line 932, in _bootstrap_inner
      self.run()
    File "/build/source/pynetdicom/dul.py", line 416, in run
      self.state_machine.do_action(event)
    File "/build/source/pynetdicom/fsm.py", line 64, in do_action
      raise InvalidEventError(msg)
  pynetdicom.fsm.InvalidEventError: Invalid event 'Evt15' for the current state 'Sta13'
  
    warnings.warn(pytest.PytestUnhandledThreadExceptionWarning(msg))

pynetdicom/tests/test_assoc.py::TestAssociationSendCEcho::test_rsp_invalid
  /nix/store/jmzx9dsqb96865swyvs0ib9g5dz2qdwg-python3.8-pytest-6.2.3/lib/python3.8/site-packages/_pytest/threadexception.py:75: PytestUnhandledThreadExceptionWarning: Exception in thread [email protected]
  
  Traceback (most recent call last):
    File "/nix/store/q6gfck5czr67090pwm53xrdyhpg6bx67-python3-3.8.9/lib/python3.8/threading.py", line 932, in _bootstrap_inner
      self.run()
    File "/build/source/pynetdicom/association.py", line 620, in run
      self._run_reactor()
    File "/build/source/pynetdicom/association.py", line 657, in _run_reactor
      self._serve_request(msg, context_id)
    File "/build/source/pynetdicom/association.py", line 3262, in _serve_request
      if not msg.is_valid_request:
  AttributeError: 'DummyResponse' object has no attribute 'is_valid_request'
  
    warnings.warn(pytest.PytestUnhandledThreadExceptionWarning(msg))

pynetdicom/tests/test_assoc.py::TestAssociationSendCStore::test_dataset_no_transfer_syntax_raises
pynetdicom/tests/test_service_qr.py::TestQRCompositeInstanceWithoutBulk::test_pixel_data
pynetdicom/tests/test_service_qr.py::TestQRCompositeInstanceWithoutBulk::test_waveform_sequence
  /nix/store/zikzb9dglfjwml2jizw701fi9afsp2d9-python3.8-pydicom-2.1.2/lib/python3.8/site-packages/pydicom/dataset.py:516: UserWarning: Invalid value used with the 'in' operator: must be an element tag as a 2-tuple or int, or an element keyword
    warnings.warn(msg)

pynetdicom/tests/test_assoc.py::TestAssociationSendCGet::test_decode_failure
  /nix/store/jmzx9dsqb96865swyvs0ib9g5dz2qdwg-python3.8-pytest-6.2.3/lib/python3.8/site-packages/_pytest/threadexception.py:75: PytestUnhandledThreadExceptionWarning: Exception in thread Thread-1816
  
  Traceback (most recent call last):
    File "/nix/store/q6gfck5czr67090pwm53xrdyhpg6bx67-python3-3.8.9/lib/python3.8/threading.py", line 932, in _bootstrap_inner
      self.run()
    File "/build/source/pynetdicom/dul.py", line 416, in run
      self.state_machine.do_action(event)
    File "/build/source/pynetdicom/fsm.py", line 76, in do_action
      next_state = action[1](self.dul)
    File "/build/source/pynetdicom/fsm.py", line 781, in AA_3
      assoc.dimse.msg_queue.put((None, None))
  AttributeError: 'DummyDIMSE' object has no attribute 'msg_queue'
  
    warnings.warn(pytest.PytestUnhandledThreadExceptionWarning(msg))

pynetdicom/tests/test_assoc.py::TestAssociationSendCMove::test_decode_failure
  /nix/store/jmzx9dsqb96865swyvs0ib9g5dz2qdwg-python3.8-pytest-6.2.3/lib/python3.8/site-packages/_pytest/threadexception.py:75: PytestUnhandledThreadExceptionWarning: Exception in thread Thread-2142
  
  Traceback (most recent call last):
    File "/nix/store/q6gfck5czr67090pwm53xrdyhpg6bx67-python3-3.8.9/lib/python3.8/threading.py", line 932, in _bootstrap_inner
      self.run()
    File "/build/source/pynetdicom/dul.py", line 416, in run
      self.state_machine.do_action(event)
    File "/build/source/pynetdicom/fsm.py", line 76, in do_action
      next_state = action[1](self.dul)
    File "/build/source/pynetdicom/fsm.py", line 810, in AA_4
      assoc.dimse.msg_queue.put((None, None))
  AttributeError: 'DummyDIMSE' object has no attribute 'msg_queue'
  
    warnings.warn(pytest.PytestUnhandledThreadExceptionWarning(msg))

pynetdicom/tests/test_assoc_n.py::TestAssociationSendNAction::test_rsp_bad_dataset
  /nix/store/jmzx9dsqb96865swyvs0ib9g5dz2qdwg-python3.8-pytest-6.2.3/lib/python3.8/site-packages/_pytest/threadexception.py:75: PytestUnhandledThreadExceptionWarning: Exception in thread [email protected]
  
  Traceback (most recent call last):
    File "/nix/store/q6gfck5czr67090pwm53xrdyhpg6bx67-python3-3.8.9/lib/python3.8/threading.py", line 932, in _bootstrap_inner
      self.run()
    File "/build/source/pynetdicom/association.py", line 620, in run
      self._run_reactor()
    File "/build/source/pynetdicom/association.py", line 657, in _run_reactor
      self._serve_request(msg, context_id)
    File "/build/source/pynetdicom/association.py", line 3262, in _serve_request
      if not msg.is_valid_request:
  AttributeError: 'DummyMessage' object has no attribute 'is_valid_request'
  
    warnings.warn(pytest.PytestUnhandledThreadExceptionWarning(msg))

pynetdicom/tests/test_service_n.py::TestUPSFindServiceClass::test_bad_req_identifier
pynetdicom/tests/test_service_non_patient.py::TestNonPatientObjectStorageServiceClass::test_scp_failed_ds_decode
pynetdicom/tests/test_service_qr.py::TestQRFindServiceClass::test_bad_req_identifier
pynetdicom/tests/test_service_relevant_patient.py::TestRelevantPatientServiceClass::test_bad_req_identifier
pynetdicom/tests/test_service_storage.py::TestStorageServiceClass::test_status_enum
pynetdicom/tests/test_service_storage.py::TestStorageServiceClass::test_scp_failed_ds_decode
pynetdicom/tests/test_service_substance_admin.py::TestSubstanceAdministrationQueryServiceClass::test_bad_req_identifier
  /nix/store/zikzb9dglfjwml2jizw701fi9afsp2d9-python3.8-pydicom-2.1.2/lib/python3.8/site-packages/pydicom/filereader.py:300: UserWarning: Expected explicit VR, but found implicit VR - using implicit VR for reading
    warnings.warn(message, UserWarning)

-- Docs: https://docs.pytest.org/en/stable/warnings.html
=========================== short test summary info ============================
FAILED pynetdicom/apps/tests/test_getscu.py::TestGetSCUCLI::test_flag_ta - In...
= 1 failed, 2697 passed, 19 skipped, 550 deselected, 195 warnings in 922.69s (0:15:22) =

Leave a Reply

Your email address will not be published. Required fields are marked *